Cleanup, remove the now redundant error-code-xxx tests (they were moved to error-xxx 7 months ago)
authorabraaksm
Mon, 30 Mar 2015 19:29:32 +0200
changeset 895 c964d5bbd00e
parent 894 0fc26a1f66f4
child 896 b99b90a57a1c
Cleanup, remove the now redundant error-code-xxx tests (they were moved to error-xxx 7 months ago)
catalog.xml
tests/misc/error-code/_error-code-test-set.xml
tests/misc/error-code/convert-tests.xsl
tests/misc/error-code/error-code-001.xsl
tests/misc/error-code/error-code-002.xsl
tests/misc/error-code/error-code-003.xsl
tests/misc/error-code/error-code-004.xsl
tests/misc/error-code/error-code-005.xsl
tests/misc/error-code/error-code-006.xsl
tests/misc/error-code/error-code-007.xsl
tests/misc/error-code/error-code-008.xsl
tests/misc/error-code/error-code-009.xsl
tests/misc/error-code/error-code-010.xsl
tests/misc/error-code/error-code-011.xsl
tests/misc/error-code/error-code-012.xsl
tests/misc/error-code/error-code-013.xsl
tests/misc/error-code/error-code-014.xsl
tests/misc/error-code/error-code-015.xsl
tests/misc/error-code/error-code-016.xsl
tests/misc/error-code/error-code-017.xsl
tests/misc/error-code/error-code-018.xsl
tests/misc/error-code/error-code-019.xsl
tests/misc/error-code/error-code-020.xsl
tests/misc/error-code/error-code-021.xsl
tests/misc/error-code/error-code-022.xsl
tests/misc/error-code/error-code-023.xsl
tests/misc/error-code/error-code-024.xsl
tests/misc/error-code/error-code-025.xsl
tests/misc/error-code/error-code-026.xsl
tests/misc/error-code/error-code-027.xsl
tests/misc/error-code/error-code-028.xsl
tests/misc/error-code/error-code-029.xsl
tests/misc/error-code/error-code-030.xsl
tests/misc/error-code/error-code-031.xsl
tests/misc/error-code/error-code-032.xsl
tests/misc/error-code/error-code-033.xsl
tests/misc/error-code/error-code-034.xsl
tests/misc/error-code/error-code-034a.xsl
tests/misc/error-code/error-code-035.xsl
tests/misc/error-code/error-code-036.xsl
tests/misc/error-code/error-code-037.xsl
tests/misc/error-code/error-code-038.xsl
tests/misc/error-code/error-code-039.xsl
tests/misc/error-code/error-code-040.xsl
tests/misc/error-code/error-code-041.xsl
tests/misc/error-code/error-code-042.xsl
tests/misc/error-code/error-code-043.xsl
tests/misc/error-code/error-code-044.xsl
tests/misc/error-code/error-code-045.xsl
tests/misc/error-code/error-code-046.xsl
tests/misc/error-code/error-code-047.xsl
tests/misc/error-code/error-code-048.xsl
tests/misc/error-code/error-code-049.xsl
tests/misc/error-code/error-code-050.xsl
tests/misc/error-code/error-code-051.xsl
tests/misc/error-code/error-code-052.xsl
tests/misc/error-code/error-code-053.xsl
tests/misc/error-code/error-code-054.xsl
tests/misc/error-code/error-code-055.xsl
tests/misc/error-code/error-code-056.xsl
tests/misc/error-code/error-code-057.xsl
tests/misc/error-code/error-code-058.xsl
tests/misc/error-code/error-code-059.xsl
tests/misc/error-code/error-code-060.xsl
tests/misc/error-code/error-code-061.xsl
tests/misc/error-code/error-code-062.xsl
tests/misc/error-code/error-code-063.xsl
tests/misc/error-code/error-code-064.xsl
tests/misc/error-code/error-code-065.xsl
tests/misc/error-code/error-code-066.xsl
tests/misc/error-code/error-code-067.xsl
tests/misc/error-code/error-code-068.xsl
tests/misc/error-code/error-code-069.xsl
tests/misc/error-code/error-code-070.xsl
tests/misc/error-code/error-code-071.xsl
tests/misc/error-code/error-code-072.xsl
tests/misc/error-code/error-code-073.xsl
tests/misc/error-code/error-code-074.xsl
tests/misc/error-code/error-code-075.xsl
tests/misc/error-code/error-code-076.xsl
tests/misc/error-code/error-code-077.xsl
tests/misc/error-code/error-code-078.xsl
tests/misc/error-code/error-code-079.xsl
tests/misc/error-code/error-code-080.xsl
tests/misc/error-code/error-code-081.xsl
tests/misc/error-code/error-code-082.xsl
tests/misc/error-code/error-code-083.xsl
tests/misc/error-code/error-code-084.xsl
tests/misc/error-code/error-code-085.xsl
tests/misc/error-code/error-code-086.xsl
tests/misc/error-code/error-code-087.xsl
tests/misc/error-code/error-code-088.xsl
tests/misc/error-code/error-code-089.xsl
tests/misc/error-code/error-code-090.xsl
tests/misc/error-code/error-code-091.xsl
tests/misc/error-code/error-code-092.xsl
tests/misc/error-code/error-code-093.xsl
tests/misc/error-code/error-code-094.xsl
tests/misc/error-code/error-code-095.xsl
tests/misc/error-code/error-code-096.xsl
tests/misc/error-code/error-code-097.xsl
tests/misc/error-code/error-code-098.xsl
tests/misc/error-code/error-code-099.xsl
tests/misc/error-code/error-code-100.xsl
tests/misc/error-code/error-code-101.xsl
tests/misc/error-code/error-code-102.xsl
tests/misc/error-code/error-code-103.xsl
tests/misc/error-code/error-code-104.xsl
tests/misc/error-code/error-code-105.xsl
tests/misc/error-code/error-code-106.xsl
tests/misc/error-code/error-code-107.xsl
tests/misc/error-code/error-code-108.xsl
tests/misc/error-code/error-code-109.xsl
tests/misc/error-code/error-code-110.xsl
tests/misc/error-code/error-code-111.xsl
tests/misc/error-code/error-code-112.xsl
tests/misc/error-code/error-code-113.xsl
tests/misc/error-code/error-code-114.xsl
tests/misc/error-code/error-code-115.xsl
tests/misc/error-code/error-code-116.xsl
tests/misc/error-code/error-code-117.xsl
tests/misc/error-code/error-code-118.xsl
tests/misc/error-code/error-code-119.xsl
tests/misc/error-code/error-code-120.xsl
tests/misc/error-code/error-code-121.xsl
tests/misc/error-code/error-code-122.xsl
tests/misc/error-code/error-code-123.xsl
tests/misc/error-code/error-code-124.xsl
tests/misc/error-code/error-code-125.xsl
tests/misc/error-code/error-code-126.xsl
tests/misc/error-code/error-code-127.xsl
tests/misc/error-code/error-code-128.xsl
tests/misc/error-code/error-code-129.xsl
tests/misc/error-code/error-code-130.xsl
tests/misc/error-code/error-code-131.xsl
tests/misc/error-code/error-code-132.xsl
tests/misc/error-code/error-code-133.xsl
tests/misc/error-code/error-code-134.xsl
tests/misc/error-code/error-code-135.xsl
tests/misc/error-code/error-code-136.xsl
tests/misc/error-code/error-code-137.xsl
tests/misc/error-code/error-code-138.xsl
tests/misc/error-code/error-code-139.xsl
tests/misc/error-code/error-code-140.xsl
tests/misc/error-code/error-code-141.xsl
tests/misc/error-code/error-code-142.xsl
tests/misc/error-code/error-code-143.xsl
tests/misc/error-code/error-code-144.xsl
tests/misc/error-code/error-code-145.xsl
tests/misc/error-code/error-code-146.xsl
tests/misc/error-code/error-code-147.xsl
tests/misc/error-code/error-code-148.xsl
tests/misc/error-code/error-code-149.xsl
tests/misc/error-code/error-code-150.xsl
tests/misc/error-code/error-code-151.xsl
tests/misc/error-code/error-code-152.xsl
tests/misc/error-code/error-code-153.xsl
tests/misc/error-code/error-code-154.xsl
tests/misc/error-code/error-code-155.xsl
tests/misc/error-code/error-code-156.xsl
tests/misc/error-code/error-code-157.xsl
tests/misc/error-code/error-code-158.xsl
tests/misc/error-code/error-code-159.xsl
tests/misc/error-code/error-code-160.xsl
tests/misc/error-code/error-code-161.xsl
tests/misc/error-code/error-code-162.xsl
tests/misc/error-code/error-code-163.xsl
tests/misc/error-code/error-code-164.xsl
tests/misc/error-code/error-code-165.xsl
tests/misc/error-code/error-code-166.xsl
tests/misc/error-code/error-code-167.xsl
tests/misc/error-code/error-code-168.xsl
tests/misc/error-code/error-code-169.xsl
tests/misc/error-code/error-code-170.xsl
tests/misc/error-code/error-code-171.xsl
tests/misc/error-code/error-code-172.xsl
tests/misc/error-code/error-code-173.xsl
tests/misc/error-code/error-code-174.xsl
tests/misc/error-code/error-code-175.xsl
tests/misc/error-code/error-code-176.xsl
tests/misc/error-code/error-code-177.xsl
tests/misc/error-code/error-code-178.xsl
tests/misc/error-code/error-code-179.xsl
tests/misc/error-code/error-code-180.xsl
tests/misc/error-code/error-code-181.xsl
tests/misc/error-code/error-code-182.xsl
tests/misc/error-code/error-code-183.xsl
tests/misc/error-code/error-code-184.xsl
tests/misc/error-code/error-code-185.xsl
tests/misc/error-code/error-code-186.xsl
tests/misc/error-code/error-code-187.xsl
tests/misc/error-code/error-code-188.xsl
tests/misc/error-code/error-code-189.xsl
tests/misc/error-code/error-code-190.xsl
tests/misc/error-code/error-code-191.xsl
tests/misc/error-code/error-code-192.xsl
tests/misc/error-code/error-code-193.xsl
tests/misc/error-code/error-code-194.xsl
tests/misc/error-code/error-code-195.xsl
tests/misc/error-code/error-code-196.xsl
tests/misc/error-code/error-code-197.xsl
tests/misc/error-code/error-code-198.xsl
tests/misc/error-code/error-code-199.xsl
tests/misc/error-code/error-code-200.xsl
tests/misc/error-code/error-code-201.xsl
tests/misc/error-code/error-code-202.xsl
tests/misc/error-code/error-code-203.xsl
tests/misc/error-code/error-code-204.xsl
tests/misc/error-code/error-code-205.xsl
tests/misc/error-code/error-code-206.xsl
tests/misc/error-code/error-code-207.xsl
tests/misc/error-code/error-code-208.xsl
tests/misc/error-code/error-code-209.xsl
tests/misc/error-code/error-code-210.xsl
tests/misc/error-code/error-code-211.xsl
tests/misc/error-code/error-code-212.xsl
tests/misc/error-code/error-code-213.xsl
tests/misc/error-code/error-code-214.xsl
tests/misc/error-code/error-code-215.xsl
tests/misc/error-code/error-code-216.xsl
tests/misc/error-code/error-code-217.xsl
tests/misc/error-code/error-code-218.xsl
tests/misc/error-code/error-code-219.xsl
tests/misc/error-code/error-code-220.xsl
tests/misc/error-code/error-code-221.xsl
tests/misc/error-code/error-code-222.xsl
tests/misc/error-code/error-code-223.xsl
tests/misc/error-code/error-code-224.xsl
tests/misc/error-code/error-code-225.xsl
tests/misc/error-code/error-code-226.xsl
tests/misc/error-code/error-code-227.xsl
tests/misc/error-code/error-code-228.xsl
tests/misc/error-code/error-code-228a.xsl
tests/misc/error-code/error-code-229.xsl
tests/misc/error-code/error-code-231.xsl
tests/misc/error-code/error-code-232.xsl
tests/misc/error-code/error-code-233.xsl
tests/misc/error-code/error-code-234.xsl
tests/misc/error-code/error-code-235.xsl
tests/misc/error-code/error-code-236.xsl
tests/misc/error-code/error-code-237.xsl
tests/misc/error-code/error-code-238.xsl
tests/misc/error-code/error-code-239.xsl
tests/misc/error-code/error-code-240.xsl
tests/misc/error-code/error-code-241.xsl
tests/misc/error-code/error-code-242.xsl
tests/misc/error-code/error-code-243.xsl
tests/misc/error-code/error-code-244.xsl
tests/misc/error-code/error-code-245.xsl
tests/misc/error-code/error-code-246.xsl
tests/misc/error-code/error-code-247.xsl
tests/misc/error-code/error-code-248.xsl
tests/misc/error-code/error-code-249.xsl
tests/misc/error-code/error-code-250.xsl
tests/misc/error-code/error-code-251.xsl
tests/misc/error-code/error-code-252.xsl
tests/misc/error-code/error-code-253.xsl
tests/misc/error-code/error-code-254.xsl
tests/misc/error-code/error-code-255.xsl
tests/misc/error-code/error-code-256.xsl
tests/misc/error-code/error-code-257.xsl
tests/misc/error-code/error-code-258.xsl
tests/misc/error-code/error-code-259.xsl
tests/misc/error-code/error-code-260.xsl
tests/misc/error-code/error-code-261.xsl
tests/misc/error-code/error-code-262.xsl
tests/misc/error-code/error-code-263.xsl
tests/misc/error-code/error-code-264.xsl
tests/misc/error-code/error-code-265.xsl
tests/misc/error-code/error-code-266.xsl
tests/misc/error-code/error-code-267.xsl
tests/misc/error-code/error-code-268.xsl
tests/misc/error-code/error-code-269.xsl
tests/misc/error-code/error-code-270.xsl
tests/misc/error-code/error-code-271.xsl
tests/misc/error-code/error-code-272.xsl
tests/misc/error-code/error-code-273.xsl
tests/misc/error-code/error-code-274.xsl
tests/misc/error-code/error-code-275.xsl
tests/misc/error-code/error-code-276.xsl
tests/misc/error-code/error-code-277.xsl
tests/misc/error-code/error-code-278.xsl
tests/misc/error-code/error-code-279.xsl
tests/misc/error-code/error-code-280.xsl
tests/misc/error-code/error-code-281.xsl
tests/misc/error-code/error-code-282.xsl
tests/misc/error-code/error-code-283.xsl
tests/misc/error-code/error-code-284.xsl
tests/misc/error-code/error-code-285.xsl
tests/misc/error-code/error-code-286.xsl
tests/misc/error-code/error-code-287.xsl
tests/misc/error-code/error-code-288.xsl
tests/misc/error-code/error-code-289.xsl
tests/misc/error-code/error-code-290.xsl
tests/misc/error-code/error-code-291.xsl
tests/misc/error-code/error-code-292.xsl
tests/misc/error-code/error-code-293.xsl
tests/misc/error-code/error-code-294.xsl
tests/misc/error-code/error-code-295.xsl
tests/misc/error-code/error-code-296.xsl
tests/misc/error-code/error-code-297.xsl
tests/misc/error-code/error-code-298.xsl
tests/misc/error-code/error-code-299.xsl
tests/misc/error-code/error-code-300.xsl
tests/misc/error-code/error-code-301.xsl
tests/misc/error-code/error-code-302.xsl
tests/misc/error-code/error-code-303.xsl
tests/misc/error-code/error-code-304.xsl
tests/misc/error-code/error-code-305.xsl
tests/misc/error-code/error-code-306.xsl
tests/misc/error-code/error-code-307.xsl
tests/misc/error-code/error-code-308.xsl
tests/misc/error-code/error-code-309.xsl
tests/misc/error-code/error-code-310.xsl
tests/misc/error-code/error-code-311.xsl
tests/misc/error-code/error-code-312.xsl
tests/misc/error-code/error-code-313.xsl
tests/misc/error-code/error-code-314.xsl
tests/misc/error-code/error-code-315.xsl
tests/misc/error-code/error-code-316.xsl
tests/misc/error-code/error-code-317.xsl
tests/misc/error-code/error-code-318.xsl
tests/misc/error-code/error-code-319.xsl
tests/misc/error-code/error-code-320.xsl
tests/misc/error-code/error-code-321.xsl
tests/misc/error-code/error-code-322.xsl
tests/misc/error-code/error-code-323.xsl
tests/misc/error-code/error-code-324.xsl
tests/misc/error-code/error-code-325.xsl
tests/misc/error-code/error-code-326.xsl
tests/misc/error-code/error-code-327.xsl
tests/misc/error-code/error-code-328.xsl
tests/misc/error-code/error-code-329.xsl
tests/misc/error-code/error-code-330.xsl
tests/misc/error-code/error-code-331.xsl
tests/misc/error-code/error-code-332.xsl
tests/misc/error-code/error-code-333.xsl
tests/misc/error-code/error-code-334.xsl
tests/misc/error-code/error-code-335.xsl
tests/misc/error-code/error-code-336.xsl
tests/misc/error-code/error-code-337.xsl
tests/misc/error-code/error-code-338.xsl
tests/misc/error-code/error-code-339.xsl
tests/misc/error-code/error-code-340.xsl
tests/misc/error-code/error-code-341.xsl
tests/misc/error-code/error-code-342.xsl
tests/misc/error-code/error-code-343.xsl
tests/misc/error-code/error-code-344.xsl
tests/misc/error-code/error-code-345.xsl
tests/misc/error-code/error-code-346.xsl
tests/misc/error-code/error-code-347.xsl
tests/misc/error-code/error-code-348.xsl
tests/misc/error-code/error-code-349.xsl
tests/misc/error-code/error-code-350.xsl
tests/misc/error-code/error-code-351.xsl
tests/misc/error-code/error-code-352.xsl
tests/misc/error-code/error-code-353.xsl
tests/misc/error-code/error-code-354.xsl
tests/misc/error-code/error-code-355.xsl
tests/misc/error-code/error-code-356.xsl
tests/misc/error-code/error-code-357.xsl
tests/misc/error-code/error-code-358.xsl
tests/misc/error-code/error-code-359.xsl
tests/misc/error-code/error-code-360.xsl
tests/misc/error-code/error-code-361.xsl
tests/misc/error-code/error-code-362.xsl
tests/misc/error-code/error-code-363.xsl
tests/misc/error-code/error-code-364.xsl
tests/misc/error-code/error-code-365.xsl
tests/misc/error-code/error-code-366.xsl
tests/misc/error-code/error-code-367.xsl
tests/misc/error-code/error-code-368.xsl
tests/misc/error-code/error-code-369.xsl
tests/misc/error-code/error-code-370.xsl
tests/misc/error-code/error-code-371.xsl
tests/misc/error-code/error-code-372.xsl
tests/misc/error-code/error-code-373.xsl
tests/misc/error-code/error-code-374.xsl
tests/misc/error-code/error-code-375.xsl
tests/misc/error-code/error-code-376.xsl
tests/misc/error-code/error-code-377.xsl
tests/misc/error-code/error-code-378.xsl
tests/misc/error-code/error-code-379.xsl
tests/misc/error-code/error-code-380.xsl
tests/misc/error-code/error-code-381.xsl
tests/misc/error-code/error-code-382.xsl
tests/misc/error-code/error-code-383.xsl
tests/misc/error-code/error-code-384.xsl
tests/misc/error-code/error-code-385.xsl
tests/misc/error-code/error-code-386.xsl
tests/misc/error-code/error-code-387.xsl
tests/misc/error-code/error-code-388.xsl
tests/misc/error-code/error-code-389.xsl
tests/misc/error-code/error-code-390.xsl
tests/misc/error-code/error-code-391.xsl
tests/misc/error-code/error-code-392.xsl
tests/misc/error-code/error-code-393.xsl
tests/misc/error-code/error-code-394.xsl
tests/misc/error-code/error-code-395.xsl
tests/misc/error-code/error-code-396.xsl
tests/misc/error-code/error-code-397.xsl
tests/misc/error-code/error-code-398.xsl
tests/misc/error-code/error-code-399.xsl
tests/misc/error-code/error-code-400.xsl
tests/misc/error-code/error-code-401.xsl
tests/misc/error-code/error-code-402.xsl
tests/misc/error-code/error-code-403.xsl
tests/misc/error-code/error-code-404.xsl
tests/misc/error-code/error-code-405.xsl
tests/misc/error-code/error-code-406.xsl
tests/misc/error-code/error-code-407.xsl
tests/misc/error-code/error-code-408.xsl
tests/misc/error-code/error-code-409.xsl
tests/misc/error-code/error-code-410.xsl
tests/misc/error-code/error-code-411.xsl
tests/misc/error-code/errorcode1500.xml
tests/misc/error-code/temp.out
tests/misc/error-code/wilhelm-busch-corrupted.txt
tests/misc/error-code/wilhelm-busch.txt
--- a/catalog.xml	Mon Mar 30 18:49:39 2015 +0200
+++ b/catalog.xml	Mon Mar 30 19:29:32 2015 +0200
@@ -126,7 +126,6 @@
       <test-set name="collations" file="tests/misc/collations/_collations-test-set.xml"/>
       <test-set name="embedded-stylesheet" file="tests/misc/embedded-stylesheet/_embedded-stylesheet-test-set.xml"/>
       <test-set name="error" file="tests/misc/error/_error-test-set.xml"/>
-      <!--<test-set name="error-code" file="tests/misc/error-code/_error-code-test-set.xml"/>-->
       <test-set name="initial-function" file="tests/misc/initial-function/_initial-function-test-set.xml"/>
       <test-set name="initial-mode" file="tests/misc/initial-mode/_initial-mode-test-set.xml"/>
       <test-set name="initial-template" file="tests/misc/initial-template/_initial-template-test-set.xml"/>
--- a/tests/misc/error-code/_error-code-test-set.xml	Mon Mar 30 18:49:39 2015 +0200
+++ /dev/null	Thu Jan 01 00:00:00 1970 +0000
@@ -1,6735 +0,0 @@
-<?xml version="1.0" encoding="UTF-8"?>
-<test-set xmlns:xs="http://www.w3.org/2001/XMLSchema"
-          xmlns="http://www.w3.org/2012/10/xslt-test-catalog"
-          name="error-code">
-   
-   <description>
-      Tests error conditions. 
-      This test set should include a test for every error code (however, coverage of new XSLT 3.0 errors is incomplete).
-   </description>
-   
-   <environment name="error001">
-      <source role=".">
-         <content><![CDATA[<doc>
-  <element attribute="3"/>
-</doc>]]></content>
-      </source>
-   </environment>
-
-   <environment name="error152">
-      <source role=".">
-         <content><![CDATA[ 
-
-<doc>
-    <item val="1"/>
-    <item val="2"/>
-    <item val="3"/>
-    <item val="4"/>
-    <item val="5"/>                
-</doc>]]></content>
-      </source>
-   </environment>
-   
-   <environment name="error214">
-      <source role=".">
-         <content><![CDATA[<t04>
-  <a id="a" code="1" value="10"/>
-  <a id="b" code="2" value="20"/>
-  <a id="c" code="2" value="30"/>
-  <a id="d" code="1" value="40"/>
-</t04>]]></content>
-      </source>
-   </environment>
-   
-
-   <test-case name="error-code-001">
-      <description>Error: XPath syntax</description>
-      <created by="Michael Kay" on="2012-11-07"/>
-      <environment ref="error001"/>
-      <dependencies>
-         <spec value="XSLT20+"/>
-      </dependencies>
-      <test>
-         <stylesheet file="error-code-001.xsl"/>
-      </test>
-      <result>
-         <error code="XPST0003"/>
-      </result>
-   </test-case>
-
-   <test-case name="error-code-002">
-      <description>Error: XPath syntax</description>
-      <created by="Michael Kay" on="2012-11-07"/>
-      <environment ref="error001"/>
-      <dependencies>
-         <spec value="XSLT20+"/>
-      </dependencies>
-      <test>
-         <stylesheet file="error-code-002.xsl"/>
-      </test>
-      <result>
-         <error code="XPST0003"/>
-      </result>
-   </test-case>
-
-   <test-case name="error-code-003">
-      <description>Error: XPath syntax</description>
-      <created by="Michael Kay" on="2012-11-07"/>
-      <environment ref="error001"/>
-      <dependencies>
-         <spec value="XSLT20+"/>
-      </dependencies>
-      <test>
-         <stylesheet file="error-code-003.xsl"/>
-      </test>
-      <result>
-         <error code="XPST0003"/>
-      </result>
-   </test-case>
-
-   <test-case name="error-code-004">
-      <description>Error: XPath syntax unmatched square brackets</description>
-      <created by="Michael Kay" on="2012-11-07"/>
-      <environment ref="error001"/>
-      <dependencies>
-         <spec value="XSLT20+"/>
-      </dependencies>
-      <test>
-         <stylesheet file="error-code-004.xsl"/>
-      </test>
-      <result>
-         <error code="XPST0003"/>
-      </result>
-   </test-case>
-
-   <test-case name="error-code-005">
-      <description>Error: XPath syntax unclosed string</description>
-      <created by="Michael Kay" on="2012-11-07"/>
-      <environment ref="error001"/>
-      <dependencies>
-         <spec value="XSLT20+"/>
-      </dependencies>
-      <test>
-         <stylesheet file="error-code-005.xsl"/>
-      </test>
-      <result>
-         <error code="XPST0003"/>
-      </result>
-   </test-case>
-
-   <test-case name="error-code-006">
-      <description>Error: XPath syntax</description>
-      <created by="Michael Kay" on="2012-11-07"/>
-      <environment ref="error001"/>
-      <dependencies>
-         <spec value="XSLT20+"/>
-      </dependencies>
-      <test>
-         <stylesheet file="error-code-006.xsl"/>
-      </test>
-      <result>
-         <error code="XPST0003"/>
-      </result>
-   </test-case>
-
-   <test-case name="error-code-007">
-      <description>Test declaring a variable with incorrect type "element/attribute of type X".</description>
-      <created by="Michael Kay" on="2012-11-07"/>
-      <environment ref="error001"/>
-      <dependencies>
-         <spec value="XSLT20+"/>
-         <feature value="schema_aware"/>
-      </dependencies>
-      <test>
-         <stylesheet file="error-code-007.xsl"/>
-      </test>
-      <result>
-         <error code="XTTE0570"/>
-      </result>
-   </test-case>
-
-   <test-case name="error-code-008">
-      <description>Error: XPath syntax processing instruction must be a QName</description>
-      <created by="Michael Kay" on="2012-11-07"/>
-      <environment ref="error001"/>
-      <dependencies>
-         <spec value="XSLT20+"/>
-      </dependencies>
-      <test>
-         <stylesheet file="error-code-008.xsl"/>
-      </test>
-      <result>
-         <error code="XPST0003"/>
-      </result>
-   </test-case>
-
-   <test-case name="error-code-009">
-      <description>Error: XPath syntax unknown axis</description>
-      <created by="Michael Kay" on="2012-11-07"/>
-      <environment ref="error001"/>
-      <dependencies>
-         <spec value="XSLT20+"/>
-      </dependencies>
-      <test>
-         <stylesheet file="error-code-009.xsl"/>
-      </test>
-      <result>
-         <error code="XPST0003"/>
-      </result>
-   </test-case>
-
-   <test-case name="error-code-010">
-      <description>Error: XPath syntax</description>
-      <created by="Michael Kay" on="2012-11-07"/>
-      <environment ref="error001"/>
-      <dependencies>
-         <spec value="XSLT20+"/>
-      </dependencies>
-      <test>
-         <stylesheet file="error-code-010.xsl"/>
-      </test>
-      <result>
-         <error code="XPST0017"/>
-      </result>
-   </test-case>
-
-   <test-case name="error-code-011">
-      <description>Test declaring a variable with incorrect type "element/attribute of type X".</description>
-      <created by="Michael Kay" on="2012-11-07"/>
-      <environment ref="error001"/>
-      <dependencies>
-         <spec value="XSLT20+"/>
-         <feature value="schema_aware"/>
-      </dependencies>
-      <test>
-         <stylesheet file="error-code-011.xsl"/>
-      </test>
-      <result>
-         <error code="XTTE0570"/>
-      </result>
-   </test-case>
-
-   <test-case name="error-code-012">
-      <description>Error: XPath syntax</description>
-      <created by="Michael Kay" on="2012-11-07"/>
-      <environment ref="error001"/>
-      <dependencies>
-         <spec value="XSLT20+"/>
-      </dependencies>
-      <test>
-         <stylesheet file="error-code-012.xsl"/>
-      </test>
-      <result>
-         <error code="XPST0081"/>
-      </result>
-   </test-case>
-
-   <test-case name="error-code-013">
-      <description>Error: XPath syntax</description>
-      <created by="Michael Kay" on="2012-11-07"/>
-      <environment ref="error001"/>
-      <dependencies>
-         <spec value="XSLT20+"/>
-      </dependencies>
-      <test>
-         <stylesheet file="error-code-013.xsl"/>
-      </test>
-      <result>
-         <error code="XPST0008"/>
-      </result>
-   </test-case>
-
-   <test-case name="error-code-014">
-      <description>Error: XPath syntax needs a space</description>
-      <created by="Michael Kay" on="2012-11-07"/>
-      <environment ref="error001"/>
-      <dependencies>
-         <spec value="XSLT20+"/>
-      </dependencies>
-      <test>
-         <stylesheet file="error-code-014.xsl"/>
-      </test>
-      <result>
-         <error code="XPST0003"/>
-      </result>
-   </test-case>
-
-   <test-case name="error-code-015">
-      <description>Error: XPath syntax</description>
-      <created by="Michael Kay" on="2012-11-07"/>
-      <environment ref="error001"/>
-      <dependencies>
-         <spec value="XSLT20+"/>
-      </dependencies>
-      <test>
-         <stylesheet file="error-code-015.xsl"/>
-      </test>
-      <result>
-         <error code="XPST0003"/>
-      </result>
-   </test-case>
-
-   <test-case name="error-code-016">
-      <description>Error: XPath syntax</description>
-      <created by="Michael Kay" on="2012-11-07"/>
-      <environment ref="error001"/>
-      <dependencies>
-         <spec value="XSLT20+"/>
-      </dependencies>
-      <test>
-         <stylesheet file="error-code-016.xsl"/>
-      </test>
-      <result>
-         <error code="XPST0003"/>
-      </result>
-   </test-case>
-
-   <test-case name="error-code-017">
-      <description>Error: XPath syntax</description>
-      <created by="Michael Kay" on="2012-11-07"/>
-      <environment ref="error001"/>
-      <dependencies>
-         <spec value="XSLT20+"/>
-      </dependencies>
-      <test>
-         <stylesheet file="error-code-017.xsl"/>
-      </test>
-      <result>
-         <error code="XPST0017"/>
-      </result>
-   </test-case>
-
-   <test-case name="error-code-018">
-      <description>Error: &lt;xsl:param&gt; must come first</description>
-      <created by="Michael Kay" on="2012-11-07"/>
-      <environment ref="error001"/>
-      <dependencies>
-         <spec value="XSLT20+"/>
-      </dependencies>
-      <test>
-         <stylesheet file="error-code-018.xsl"/>
-      </test>
-      <result>
-         <error code="XTSE0010"/>
-      </result>
-   </test-case>
-
-   <test-case name="error-code-019">
-      <description>TEST xsl:namespace declaring the default namespace (XSLT 2.0) this is an error if the element is in no namespace</description>
-      <created by="Michael Kay" on="2012-11-07"/>
-      <environment ref="error001"/>
-      <dependencies>
-         <spec value="XSLT20+"/>
-      </dependencies>
-      <test>
-         <stylesheet file="error-code-019.xsl"/>
-      </test>
-      <result>
-         <error code="XTDE0440"/>
-      </result>
-   </test-case>
-
-   <test-case name="error-code-020">
-      <description>Error: XPath syntax</description>
-      <created by="Michael Kay" on="2012-11-07"/>
-      <environment ref="error001"/>
-      <dependencies>
-         <spec value="XSLT20+"/>
-      </dependencies>
-      <test>
-         <stylesheet file="error-code-020.xsl"/>
-      </test>
-      <result>
-         <error code="XPTY0004"/>
-      </result>
-   </test-case>
-
-   <test-case name="error-code-021">
-      <description>Error: XPath syntax</description>
-      <created by="Michael Kay" on="2012-11-07"/>
-      <environment ref="error001"/>
-      <dependencies>
-         <spec value="XSLT20+"/>
-      </dependencies>
-      <test>
-         <stylesheet file="error-code-021.xsl"/>
-      </test>
-      <result>
-         <error code="XPST0003"/>
-      </result>
-   </test-case>
-
-   <test-case name="error-code-022">
-      <description>Error: XPath syntax</description>
-      <created by="Michael Kay" on="2012-11-07"/>
-      <environment ref="error001"/>
-      <dependencies>
-         <spec value="XSLT20+"/>
-      </dependencies>
-      <test>
-         <stylesheet file="error-code-022.xsl"/>
-      </test>
-      <result>
-         <error code="XPST0081"/>
-      </result>
-   </test-case>
-
-   <test-case name="error-code-023">
-      <description>Error: XPath syntax</description>
-      <created by="Michael Kay" on="2012-11-07"/>
-      <environment ref="error001"/>
-      <dependencies>
-         <spec value="XSLT20+"/>
-      </dependencies>
-      <test>
-         <stylesheet file="error-code-023.xsl"/>
-      </test>
-      <result>
-         <error code="XPST0081"/>
-      </result>
-   </test-case>
-
-   <test-case name="error-code-024">
-      <description>Error: XPath syntax</description>
-      <created by="Michael Kay" on="2012-11-07"/>
-      <environment ref="error001"/>
-      <dependencies>
-         <spec value="XSLT20+"/>
-      </dependencies>
-      <test>
-         <stylesheet file="error-code-024.xsl"/>
-      </test>
-      <result>
-         <error code="XPST0081"/>
-      </result>
-   </test-case>
-
-   <test-case name="error-code-025">
-      <description>error: context item is not set on entry to a stylesheet function</description>
-      <created by="Michael Kay" on="2012-11-07"/>
-      <environment ref="error001"/>
-      <dependencies>
-         <spec value="XSLT20+"/>
-      </dependencies>
-      <test>
-         <stylesheet file="error-code-025.xsl"/>
-      </test>
-      <result>
-         <error code="XPDY0002"/>
-      </result>
-   </test-case>
-
-   <test-case name="error-code-026">
-      <description>Error: XPath syntax</description>
-      <created by="Michael Kay" on="2012-11-07"/>
-      <environment ref="error001"/>
-      <dependencies>
-         <spec value="XSLT20+"/>
-      </dependencies>
-      <test>
-         <stylesheet file="error-code-026.xsl"/>
-      </test>
-      <result>
-         <error code="XPST0003"/>
-      </result>
-   </test-case>
-
-   <test-case name="error-code-027">
-      <description>Error: XPath syntax</description>
-      <created by="Michael Kay" on="2012-11-07"/>
-      <environment ref="error001"/>
-      <dependencies>
-         <spec value="XSLT20+"/>
-      </dependencies>
-      <test>
-         <stylesheet file="error-code-027.xsl"/>
-      </test>
-      <result>
-         <error code="XPST0003"/>
-      </result>
-   </test-case>
-
-   <test-case name="error-code-028">
-      <description>Error: XPath syntax not a valid XML Name character</description>
-      <created by="Michael Kay" on="2012-11-07"/>
-      <environment ref="error001"/>
-      <dependencies>
-         <spec value="XSLT20+"/>
-      </dependencies>
-      <test>
-         <stylesheet file="error-code-028.xsl"/>
-      </test>
-      <result>
-         <error code="XPST0003"/>
-      </result>
-   </test-case>
-
-   <test-case name="error-code-029">
-      <description>Error: XPath syntax</description>
-      <created by="Michael Kay" on="2012-11-07"/>
-      <environment ref="error001"/>
-      <dependencies>
-         <spec value="XSLT20+"/>
-      </dependencies>
-      <test>
-         <stylesheet file="error-code-029.xsl"/>
-      </test>
-      <result>
-         <error code="XPST0003"/>
-      </result>
-   </test-case>
-
-   <test-case name="error-code-030">
-      <description>Error: XPath syntax</description>
-      <created by="Michael Kay" on="2012-11-07"/>
-      <environment ref="error001"/>
-      <dependencies>
-         <spec value="XSLT20+"/>
-      </dependencies>
-      <test>
-         <stylesheet file="error-code-030.xsl"/>
-      </test>
-      <result>
-         <error code="XPST0003"/>
-      </result>
-   </test-case>
-
-   <test-case name="error-code-031">
-      <description>Error: XPath syntax</description>
-      <created by="Michael Kay" on="2012-11-07"/>
-      <environment ref="error001"/>
-      <dependencies>
-         <spec value="XSLT20+"/>
-      </dependencies>
-      <test>
-         <stylesheet file="error-code-031.xsl"/>
-      </test>
-      <result>
-         <error code="XPST0003"/>
-      </result>
-   </test-case>
-
-   <test-case name="error-code-032">
-      <description>Error: Calling xsl:apply-imports when the current template rule is null</description>
-      <created by="Michael Kay" on="2012-11-07"/>
-      <environment ref="error001"/>
-      <dependencies>
-         <spec value="XSLT20+"/>
-      </dependencies>
-      <test>
-         <stylesheet file="error-code-032.xsl"/>
-      </test>
-      <result>
-         <error code="XTDE0560"/>
-      </result>
-   </test-case>
-
-   <test-case name="error-code-033">
-      <description>Error: Calling xsl:apply-imports when evaluating a global variable</description>
-      <created by="Michael Kay" on="2012-11-07"/>
-      <environment ref="error001"/>
-      <dependencies>
-         <spec value="XSLT20+"/>
-      </dependencies>
-      <test>
-         <stylesheet file="error-code-033.xsl"/>
-      </test>
-      <result>
-         <error code="XTDE0560"/>
-      </result>
-   </test-case>
-
-   <test-case name="error-code-034">
-      <description>Error: xsl:template - duplicate name</description>
-      <created by="Michael Kay" on="2012-11-07"/>
-      <environment ref="error001"/>
-      <dependencies>
-         <spec value="XSLT20+"/>
-      </dependencies>
-      <test>
-         <stylesheet file="error-code-034.xsl"/>
-      </test>
-      <result>
-         <error code="XTSE0660"/>
-      </result>
-   </test-case>
-
-   <test-case name="error-code-035">
-      <description>Error: xsl:stylesheet no version att</description>
-      <created by="Michael Kay" on="2012-11-07"/>
-      <environment ref="error001"/>
-      <dependencies>
-         <spec value="XSLT20+"/>
-      </dependencies>
-      <test>
-         <stylesheet file="error-code-035.xsl"/>
-      </test>
-      <result>
-         <error code="XTSE0010"/>
-      </result>
-   </test-case>
-
-   <test-case name="error-code-036">
-      <description>Error: xsl:stylesheet extra att</description>
-      <created by="Michael Kay" on="2012-11-07"/>
-      <environment ref="error001"/>
-      <dependencies>
-         <spec value="XSLT20+"/>
-      </dependencies>
-      <test>
-         <stylesheet file="error-code-036.xsl"/>
-      </test>
-      <result>
-         <error code="XTSE0090"/>
-      </result>
-   </test-case>
-
-   <test-case name="error-code-037">
-      <description>Error: xsl:stylesheet erp attribute</description>
-      <created by="Michael Kay" on="2012-11-07"/>
-      <environment ref="error001"/>
-      <dependencies>
-         <spec value="XSLT20+"/>
-      </dependencies>
-      <test>
-         <stylesheet file="error-code-037.xsl"/>
-      </test>
-      <result>
-         <error code="XTSE0808"/>
-      </result>
-   </test-case>
-
-   <test-case name="error-code-038">
-      <description>Error: xsl:stylesheet erp attribute</description>
-      <created by="Michael Kay" on="2012-11-07"/>
-      <environment ref="error001"/>
-      <dependencies>
-         <spec value="XSLT20+"/>
-      </dependencies>
-      <test>
-         <stylesheet file="error-code-038.xsl"/>
-      </test>
-      <result>
-         <error code="XTSE0808"/>
-      </result>
-   </test-case>
-
-   <test-case name="error-code-039">
-      <description>Error: xsl:stylesheet wrong namespace</description>
-      <created by="Michael Kay" on="2012-11-07"/>
-      <environment ref="error001"/>
-      <dependencies>
-         <spec value="XSLT20+"/>
-      </dependencies>
-      <test>
-         <stylesheet file="error-code-039.xsl"/>
-      </test>
-      <result>
-         <error code="XTSE0150"/>
-      </result>
-   </test-case>
-
-   <test-case name="error-code-040">
-      <description>Error: xsl:apply-imports top level</description>
-      <created by="Michael Kay" on="2012-11-07"/>
-      <environment ref="error001"/>
-      <dependencies>
-         <spec value="XSLT20+"/>
-      </dependencies>
-      <test>
-         <stylesheet file="error-code-040.xsl"/>
-      </test>
-      <result>
-         <error code="XTSE0010"/>
-      </result>
-   </test-case>
-
-   <test-case name="error-code-041">
-      <description>Error: xsl:apply-imports extra select attribute</description>
-      <created by="Michael Kay" on="2012-11-07"/>
-      <environment ref="error001"/>
-      <dependencies>
-         <spec value="XSLT20+"/>
-      </dependencies>
-      <test>
-         <stylesheet file="error-code-041.xsl"/>
-      </test>
-      <result>
-         <error code="XTSE0090"/>
-      </result>
-   </test-case>
-
-   <test-case name="error-code-042">
-      <description>Error: xsl:apply-imports - xsl:sort not allowed here</description>
-      <created by="Michael Kay" on="2012-11-07"/>
-      <environment ref="error001"/>
-      <dependencies>
-         <spec value="XSLT20+"/>
-      </dependencies>
-      <test>
-         <stylesheet file="error-code-042.xsl"/>
-      </test>
-      <result>
-         <error code="XTSE0010"/>
-      </result>
-   </test-case>
-
-   <test-case name="error-code-043">
-      <description>Error: xsl:apply-imports - xsl:fallback not allowed here</description>
-      <created by="Michael Kay" on="2012-11-07"/>
-      <environment ref="error001"/>
-      <dependencies>
-         <spec value="XSLT20+"/>
-      </dependencies>
-      <test>
-         <stylesheet file="error-code-043.xsl"/>
-      </test>
-      <result>
-         <error code="XTSE0010"/>
-      </result>
-   </test-case>
-
-   <test-case name="error-code-044">
-      <description>Error: xsl:apply-templates (select att must be a node()*)</description>
-      <created by="Michael Kay" on="2012-11-07"/>
-      <environment ref="error001"/>
-      <dependencies>
-         <spec value="XSLT20+"/>
-      </dependencies>
-      <test>
-         <stylesheet file="error-code-044.xsl"/>
-      </test>
-      <result>
-         <error code="XTTE0520"/>
-      </result>
-   </test-case>
-
-   <test-case name="error-code-045">
-      <description>Error: xsl:apply-templates using undeclared prefix in mode name</description>
-      <created by="Michael Kay" on="2012-11-07"/>
-      <environment ref="error001"/>
-      <dependencies>
-         <spec value="XSLT20+"/>
-      </dependencies>
-      <test>
-         <stylesheet file="error-code-045.xsl"/>
-      </test>
-      <result>
-         <error code="XTSE0280"/>
-      </result>
-   </test-case>
-
-   <test-case name="error-code-046">
-      <description>Error: xsl:apply-templates disallowed attribute</description>
-      <created by="Michael Kay" on="2012-11-07"/>
-      <environment ref="error001"/>
-      <dependencies>
-         <spec value="XSLT20+"/>
-      </dependencies>
-      <test>
-         <stylesheet file="error-code-046.xsl"/>
-      </test>
-      <result>
-         <error code="XTSE0090"/>
-      </result>
-   </test-case>
-
-   <test-case name="error-code-047">
-      <description>Error: xsl:apply-templates misplaced xsl:text</description>
-      <created by="Michael Kay" on="2012-11-07"/>
-      <environment ref="error001"/>
-      <dependencies>
-         <spec value="XSLT20+"/>
-      </dependencies>
-      <test>
-         <stylesheet file="error-code-047.xsl"/>
-      </test>
-      <result>
-         <error code="XTSE0010"/>
-      </result>
-   </test-case>
-
-   <test-case name="error-code-048">
-      <description>Error: xsl:apply-templates (top level)</description>
-      <created by="Michael Kay" on="2012-11-07"/>
-      <environment ref="error001"/>
-      <dependencies>
-         <spec value="XSLT20+"/>
-      </dependencies>
-      <test>
-         <stylesheet file="error-code-048.xsl"/>
-      </test>
-      <result>
-         <error code="XTSE0010"/>
-      </result>
-   </test-case>
-
-   <test-case name="error-code-049">
-      <description>Error: xsl:call-template</description>
-      <created by="Michael Kay" on="2012-11-07"/>
-      <environment ref="error001"/>
-      <dependencies>
-         <spec value="XSLT20+"/>
-      </dependencies>
-      <test>
-         <stylesheet file="error-code-049.xsl"/>
-      </test>
-      <result>
-         <error code="XTSE0650"/>
-      </result>
-   </test-case>
-
-   <test-case name="error-code-050">
-      <description>Error: xsl:call-template with surplus attribute</description>
-      <created by="Michael Kay" on="2012-11-07"/>
-      <environment ref="error001"/>
-      <dependencies>
-         <spec value="XSLT20+"/>
-      </dependencies>
-      <test>
-         <stylesheet file="error-code-050.xsl"/>
-      </test>
-      <result>
-         <error code="XTSE0090"/>
-      </result>
-   </test-case>
-
-   <test-case name="error-code-051">
-      <description>Error: xsl:call-template misplaced xsl:sort</description>
-      <created by="Michael Kay" on="2012-11-07"/>
-      <environment ref="error001"/>
-      <dependencies>
-         <spec value="XSLT20+"/>
-      </dependencies>
-      <test>
-         <stylesheet file="error-code-051.xsl"/>
-      </test>
-      <result>
-         <error code="XTSE0010"/>
-      </result>
-   </test-case>
-
-   <test-case name="error-code-052">
-      <description>Error: xsl:call-template using an undeclared namespace</description>
-      <created by="Michael Kay" on="2012-11-07"/>
-      <environment ref="error001"/>
-      <dependencies>
-         <spec value="XSLT20+"/>
-      </dependencies>
-      <test>
-         <stylesheet file="error-code-052.xsl"/>
-      </test>
-      <result>
-         <error code="XTSE0280"/>
-      </result>
-   </test-case>
-
-   <test-case name="error-code-053">
-      <description>Error: xsl:choose</description>
-      <created by="Michael Kay" on="2012-11-07"/>
-      <environment ref="error001"/>
-      <dependencies>
-         <spec value="XSLT20+"/>
-      </dependencies>
-      <test>
-         <stylesheet file="error-code-053.xsl"/>
-      </test>
-      <result>
-         <error code="XTSE0010"/>
-      </result>
-   </test-case>
-
-   <test-case name="error-code-054">
-      <description>Error: xsl:choose</description>
-      <created by="Michael Kay" on="2012-11-07"/>
-      <environment ref="error001"/>
-      <dependencies>
-         <spec value="XSLT20+"/>
-      </dependencies>
-      <test>
-         <stylesheet file="error-code-054.xsl"/>
-      </test>
-      <result>
-         <any-of>
-            <error code="XTSE0090"/>
-            <error code="XTSE0010"/>
-         </any-of>
-      </result>
-   </test-case>
-
-   <test-case name="error-code-055">
-      <description>Error: xsl:choose</description>
-      <created by="Michael Kay" on="2012-11-07"/>
-      <environment ref="error001"/>
-      <dependencies>
-         <spec value="XSLT20+"/>
-      </dependencies>
-      <test>
-         <stylesheet file="error-code-055.xsl"/>
-      </test>
-      <result>
-         <error code="XTSE0010"/>
-      </result>
-   </test-case>
-
-   <test-case name="error-code-056">
-      <description>Error: xsl:choose</description>
-      <created by="Michael Kay" on="2012-11-07"/>
-      <environment ref="error001"/>
-      <dependencies>
-         <spec value="XSLT20+"/>
-      </dependencies>
-      <test>
-         <stylesheet file="error-code-056.xsl"/>
-      </test>
-      <result>
-         <error code="XTSE0010"/>
-      </result>
-   </test-case>
-
-   <test-case name="error-code-057">
-      <description>Error: xsl:choose</description>
-      <created by="Michael Kay" on="2012-11-07"/>
-      <environment ref="error001"/>
-      <dependencies>
-         <spec value="XSLT20+"/>
-      </dependencies>
-      <test>
-         <stylesheet file="error-code-057.xsl"/>
-      </test>
-      <result>
-         <error code="XTSE0010"/>
-      </result>
-   </test-case>
-
-   <test-case name="error-code-058">
-      <description>Error: xsl:choose</description>
-      <created by="Michael Kay" on="2012-11-07"/>
-      <environment ref="error001"/>
-      <dependencies>
-         <spec value="XSLT20+"/>
-      </dependencies>
-      <test>
-         <stylesheet file="error-code-058.xsl"/>
-      </test>
-      <result>
-         <error code="XTSE0010"/>
-      </result>
-   </test-case>
-
-   <test-case name="error-code-059">
-      <description>Error: xsl:choose</description>
-      <created by="Michael Kay" on="2012-11-07"/>
-      <environment ref="error001"/>
-      <dependencies>
-         <spec value="XSLT20+"/>
-      </dependencies>
-      <test>
-         <stylesheet file="error-code-059.xsl"/>
-      </test>
-      <result>
-         <error code="XTSE0010"/>
-      </result>
-   </test-case>
-
-   <test-case name="error-code-060">
-      <description>Error: xsl:decimal-format</description>
-      <created by="Michael Kay" on="2012-11-07"/>
-      <environment ref="error001"/>
-      <dependencies>
-         <spec value="XSLT20+"/>
-      </dependencies>
-      <test>
-         <stylesheet file="error-code-060.xsl"/>
-      </test>
-      <result>
-         <error code="XTSE0020"/>
-      </result>
-   </test-case>
-
-   <test-case name="error-code-061">
-      <description>Error: xsl:decimal-format</description>
-      <created by="Michael Kay" on="2012-11-07"/>
-      <environment ref="error001"/>
-      <dependencies>
-         <spec value="XSLT20+"/>
-      </dependencies>
-      <test>
-         <stylesheet file="error-code-061.xsl"/>
-      </test>
-      <result>
-         <error code="XTSE1290"/>
-      </result>
-   </test-case>
-
-   <test-case name="error-code-062">
-      <description>Error: xsl:decimal-format (not top level)</description>
-      <created by="Michael Kay" on="2012-11-07"/>
-      <environment ref="error001"/>
-      <dependencies>
-         <spec value="XSLT20+"/>
-      </dependencies>
-      <test>
-         <stylesheet file="error-code-062.xsl"/>
-      </test>
-      <result>
-         <error code="XTSE0010"/>
-      </result>
-   </test-case>
-
-   <test-case name="error-code-063a">
-      <description>Error: format-number - unknown xsl:decimal-format name</description>
-      <created by="Michael Kay" on="2012-11-07"/>
-      <environment ref="error001"/>
-      <dependencies>
-         <spec value="XSLT20"/>
-      </dependencies>
-      <test>
-         <stylesheet file="error-code-063.xsl"/>
-      </test>
-      <result>
-         <error code="XTDE1280"/>
-      </result>
-   </test-case>
-   
-   <test-case name="error-code-063b">
-      <description>Error: format-number - unknown xsl:decimal-format name</description>
-      <created by="Michael Kay" on="2012-11-07"/>
-      <environment ref="error001"/>
-      <dependencies>
-         <spec value="XSLT30+"/>
-      </dependencies>
-      <test>
-         <stylesheet file="error-code-063.xsl"/>
-      </test>
-      <result>
-         <error code="FODF1280"/>
-      </result>
-   </test-case>
-
-   <test-case name="error-code-064">
-      <description>Error: xsl:decimal-format</description>
-      <created by="Michael Kay" on="2012-11-07"/>
-      <environment ref="error001"/>
-      <dependencies>
-         <spec value="XSLT20+"/>
-      </dependencies>
-      <test>
-         <stylesheet file="error-code-064.xsl"/>
-      </test>
-      <result>
-         <error code="XTSE0020"/>
-      </result>
-   </test-case>
-
-   <test-case name="error-code-065a">
-      <description>Error: no decimal format</description>
-      <created by="Michael Kay" on="2012-11-07"/>
-      <environment ref="error001"/>
-      <dependencies>
-         <spec value="XSLT20"/>
-      </dependencies>
-      <test>
-         <stylesheet file="error-code-065.xsl"/>
-      </test>
-      <result>
-         <error code="XTDE1280"/>
-      </result>
-   </test-case>
-   
-   <test-case name="error-code-065b">
-      <description>Error: no decimal format</description>
-      <created by="Michael Kay" on="2012-11-07"/>
-      <environment ref="error001"/>
-      <dependencies>
-         <spec value="XSLT30+"/>
-      </dependencies>
-      <test>
-         <stylesheet file="error-code-065.xsl"/>
-      </test>
-      <result>
-         <error code="FODF1280"/>
-      </result>
-   </test-case>
-
-   <test-case name="error-code-066">
-      <description>Error: xsl:element bad element name (this was a recoverable error)</description>
-      <created by="Michael Kay" on="2012-11-07"/>
-      <environment ref="error001"/>
-      <dependencies>
-         <spec value="XSLT20+"/>
-      </dependencies>
-      <test>
-         <stylesheet file="error-code-066.xsl"/>
-      </test>
-      <result>
-         <error code="XTDE0820"/>
-      </result>
-   </test-case>
-
-   <test-case name="error-code-067">
-      <description>Error: xsl:element</description>
-      <created by="Michael Kay" on="2012-11-07"/>
-      <environment ref="error001"/>
-      <dependencies>
-         <spec value="XSLT20+"/>
-      </dependencies>
-      <test>
-         <stylesheet file="error-code-067.xsl"/>
-      </test>
-      <result>
-         <error code="XTDE0830"/>
-      </result>
-   </test-case>
-
-   <test-case name="error-code-068">
-      <description>Error: xsl:element - bad prefix in QName</description>
-      <created by="Michael Kay" on="2012-11-07"/>
-      <environment ref="error001"/>
-      <dependencies>
-         <spec value="XSLT20+"/>
-      </dependencies>
-      <test>
-         <stylesheet file="error-code-068.xsl"/>
-      </test>
-      <result>
-         <error code="XTDE0820"/>
-      </result>
-   </test-case>
-
-   <test-case name="error-code-069">
-      <description>Error: Undeclared key</description>
-      <created by="Michael Kay" on="2012-11-07"/>
-      <environment ref="error001"/>
-      <dependencies>
-         <spec value="XSLT20+"/>
-      </dependencies>
-      <test>
-         <stylesheet file="error-code-069.xsl"/>
-      </test>
-      <result>
-         <error code="XTDE1260"/>
-      </result>
-   </test-case>
-
-   <test-case name="error-code-070">
-      <description>Error: key name is not a valid QName</description>
-      <created by="Michael Kay" on="2012-11-07"/>
-      <environment ref="error001"/>
-      <dependencies>
-         <spec value="XSLT20+"/>
-      </dependencies>
-      <test>
-         <stylesheet file="error-code-070.xsl"/>
-      </test>
-      <result>
-         <error code="XTDE1260"/>
-      </result>
-   </test-case>
-
-   <test-case name="error-code-071">
-      <description>Error: key name uses undeclared prefix</description>
-      <created by="Michael Kay" on="2012-11-07"/>
-      <environment ref="error001"/>
-      <dependencies>
-         <spec value="XSLT20+"/>
-      </dependencies>
-      <test>
-         <stylesheet file="error-code-071.xsl"/>
-      </test>
-      <result>
-         <error code="XTDE1260"/>
-      </result>
-   </test-case>
-
-   <test-case name="error-code-072">
-      <description>Error: xsl:attribute-set - bad name</description>
-      <created by="Michael Kay" on="2012-11-07"/>
-      <environment ref="error001"/>
-      <dependencies>
-         <spec value="XSLT20+"/>
-      </dependencies>
-      <test>
-         <stylesheet file="error-code-072.xsl"/>
-      </test>
-      <result>
-         <error code="XTSE0020"/>
-      </result>
-   </test-case>
-
-   <test-case name="error-code-073">
-      <description>Error: xsl:attribute-set - bad name</description>
-      <created by="Michael Kay" on="2012-11-07"/>
-      <environment ref="error001"/>
-      <dependencies>
-         <spec value="XSLT20+"/>
-      </dependencies>
-      <test>
-         <stylesheet file="error-code-073.xsl"/>
-      </test>
-      <result>
-         <error code="XTSE0280"/>
-      </result>
-   </test-case>
-
-   <test-case name="error-code-074">
-      <description>Error: xsl:attribute-set - no name</description>
-      <created by="Michael Kay" on="2012-11-07"/>
-      <environment ref="error001"/>
-      <dependencies>
-         <spec value="XSLT20+"/>
-      </dependencies>
-      <test>
-         <stylesheet file="error-code-074.xsl"/>
-      </test>
-      <result>
-         <error code="XTSE0010"/>
-      </result>
-   </test-case>
-
-   <test-case name="error-code-075">
-      <description>Error: xsl:attribute-set - extra attributes</description>
-      <created by="Michael Kay" on="2012-11-07"/>
-      <environment ref="error001"/>
-      <dependencies>
-         <spec value="XSLT20+"/>
-      </dependencies>
-      <test>
-         <stylesheet file="error-code-075.xsl"/>
-      </test>
-      <result>
-         <error code="XTSE0090"/>
-      </result>
-   </test-case>
-
-   <test-case name="error-code-076">
-      <description>Error: xsl:attribute-set - bad content</description>
-      <created by="Michael Kay" on="2012-11-07"/>
-      <environment ref="error001"/>
-      <dependencies>
-         <spec value="XSLT20+"/>
-      </dependencies>
-      <test>
-         <stylesheet file="error-code-076.xsl"/>
-      </test>
-      <result>
-         <error code="XTSE0010"/>
-      </result>
-   </test-case>
-
-   <test-case name="error-code-077">
-      <description>Error: xsl:attribute-set - bad content</description>
-      <created by="Michael Kay" on="2012-11-07"/>
-      <environment ref="error001"/>
-      <dependencies>
-         <spec value="XSLT20+"/>
-      </dependencies>
-      <test>
-         <stylesheet file="error-code-077.xsl"/>
-      </test>
-      <result>
-         <error code="XTSE0010"/>
-      </result>
-   </test-case>
-
-   <test-case name="error-code-078">
-      <description>Error: xsl:attribute-set - bad content</description>
-      <created by="Michael Kay" on="2012-11-07"/>
-      <environment ref="error001"/>
-      <dependencies>
-         <spec value="XSLT20+"/>
-      </dependencies>
-      <test>
-         <stylesheet file="error-code-078.xsl"/>
-      </test>
-      <result>
-         <error code="XTSE0010"/>
-      </result>
-   </test-case>
-
-   <test-case name="error-code-079">
-      <description>Error: reference to undeclared xsl:attribute-set</description>
-      <created by="Michael Kay" on="2012-11-07"/>
-      <environment ref="error001"/>
-      <dependencies>
-         <spec value="XSLT20+"/>
-      </dependencies>
-      <test>
-         <stylesheet file="error-code-079.xsl"/>
-      </test>
-      <result>
-         <error code="XTSE0710"/>
-      </result>
-   </test-case>
-
-   <test-case name="error-code-080">
-      <description>Error: circular reference to xsl:attribute-set</description>
-      <created by="Michael Kay" on="2012-11-07"/>
-      <environment ref="error001"/>
-      <dependencies>
-         <spec value="XSLT20+"/>
-      </dependencies>
-      <test>
-         <stylesheet file="error-code-080.xsl"/>
-      </test>
-      <result>
-         <error code="XTSE0720"/>
-      </result>
-   </test-case>
-
-   <test-case name="error-code-081">
-      <description>Error: circular reference to xsl:attribute-set</description>
-      <created by="Michael Kay" on="2012-11-07"/>
-      <environment ref="error001"/>
-      <dependencies>
-         <spec value="XSLT20+"/>
-      </dependencies>
-      <test>
-         <stylesheet file="error-code-081.xsl"/>
-      </test>
-      <result>
-         <error code="XTSE0720"/>
-      </result>
-   </test-case>
-
-   <test-case name="error-code-082">
-      <description>Error: reference to unknown xsl:attribute-set</description>
-      <created by="Michael Kay" on="2012-11-07"/>
-      <environment ref="error001"/>
-      <dependencies>
-         <spec value="XSLT20+"/>
-      </dependencies>
-      <test>
-         <stylesheet file="error-code-082.xsl"/>
-      </test>
-      <result>
-         <error code="XTSE0710"/>
-      </result>
-   </test-case>
-
-   <test-case name="error-code-083">
-      <description>Error: xsl:key - bad key name</description>
-      <created by="Michael Kay" on="2012-11-07"/>
-      <environment ref="error001"/>
-      <dependencies>
-         <spec value="XSLT20+"/>
-      </dependencies>
-      <test>
-         <stylesheet file="error-code-083.xsl"/>
-      </test>
-      <result>
-         <error code="XTSE0020"/>
-      </result>
-   </test-case>
-
-   <test-case name="error-code-084">
-      <description>Error: xsl:key - no match attribute</description>
-      <created by="Michael Kay" on="2012-11-07"/>
-      <environment ref="error001"/>
-      <dependencies>
-         <spec value="XSLT20+"/>
-      </dependencies>
-      <test>
-         <stylesheet file="error-code-084.xsl"/>
-      </test>
-      <result>
-         <error code="XTSE0010"/>
-      </result>
-   </test-case>
-
-   <test-case name="error-code-085a">
-      <description>Error: xsl:key - bad match attribute</description>
-      <created by="Michael Kay" on="2012-11-07"/>
-      <environment ref="error001"/>
-      <dependencies>
-         <spec value="XSLT20"/>
-         <feature value="namespace_axis"/>
-      </dependencies>
-      <test>
-         <stylesheet file="error-code-085.xsl"/>
-      </test>
-      <result>
-         <error code="XTSE0340"/>
-      </result>
-   </test-case>
-   
-   <test-case name="error-code-085b">
-      <description>Non-Error: xsl:key - namespace allowed in XSLT 3.0</description>
-      <created by="Michael Kay" on="2012-11-07"/>
-      <environment ref="error001"/>
-      <dependencies>
-         <spec value="XSLT30"/>
-         <feature value="namespace_axis"/>
-      </dependencies>
-      <test>
-         <stylesheet file="error-code-085.xsl"/>
-      </test>
-      <result>
-         <assert>/out = ""</assert>
-      </result>
-   </test-case>
-
-   <test-case name="error-code-086">
-      <description>Error: xsl:key - circular key reference</description>
-      <created by="Michael Kay" on="2012-11-07"/>
-      <environment ref="error001"/>
-      <dependencies>
-         <spec value="XSLT20+"/>
-      </dependencies>
-      <test>
-         <stylesheet file="error-code-086.xsl"/>
-      </test>
-      <result>
-         <error code="XTDE0640"/>
-      </result>
-   </test-case>
-
-   <test-case name="error-code-087">
-      <description>Error: xsl:key - extra attribute</description>
-      <created by="Michael Kay" on="2012-11-07"/>
-      <environment ref="error001"/>
-      <dependencies>
-         <spec value="XSLT20+"/>
-      </dependencies>
-      <test>
-         <stylesheet file="error-code-087.xsl"/>
-      </test>
-      <result>
-         <error code="XTSE0090"/>
-      </result>
-   </test-case>
-
-   <test-case name="error-code-088">
-      <description>Error: xsl:key - not top-level</description>
-      <created by="Michael Kay" on="2012-11-07"/>
-      <environment ref="error001"/>
-      <dependencies>
-         <spec value="XSLT20+"/>
-      </dependencies>
-      <test>
-         <stylesheet file="error-code-088.xsl"/>
-      </test>
-      <result>
-         <error code="XTSE0010"/>
-      </result>
-   </test-case>
-
-   <test-case name="error-code-089">
-      <description>Error: xsl:include - no href</description>
-      <created by="Michael Kay" on="2012-11-07"/>
-      <environment ref="error001"/>
-      <dependencies>
-         <spec value="XSLT20+"/>
-      </dependencies>
-      <test>
-         <stylesheet file="error-code-089.xsl"/>
-      </test>
-      <result>
-         <any-of>
-            <error code="XTSE0010"/>
-            <error code="XTSE0090"/>
-         </any-of>
-      </result>
-   </test-case>
-
-   <test-case name="error-code-090">
-      <description>Error: xsl:include - file does not exist</description>
-      <created by="Michael Kay" on="2012-11-07"/>
-      <environment ref="error001"/>
-      <dependencies>
-         <spec value="XSLT20+"/>
-      </dependencies>
-      <test>
-         <stylesheet file="error-code-090.xsl"/>
-      </test>
-      <result>
-         <error code="XTSE0165"/>
-      </result>
-   </test-case>
-
-   <test-case name="error-code-091">
-      <description>Error: xsl:include - invalid URL</description>
-      <created by="Michael Kay" on="2012-11-07"/>
-      <environment ref="error001"/>
-      <dependencies>
-         <spec value="XSLT20+"/>
-      </dependencies>
-      <test>
-         <stylesheet file="error-code-091.xsl"/>
-      </test>
-      <result>
-         <error code="XTSE0165"/>
-      </result>
-   </test-case>
-
-   <test-case name="error-code-092">
-      <description>Error: xsl:include - non-empty element</description>
-      <created by="Michael Kay" on="2012-11-07"/>
-      <environment ref="error001"/>
-      <dependencies>
-         <spec value="XSLT20+"/>
-      </dependencies>
-      <test>
-         <stylesheet file="error-code-092.xsl"/>
-      </test>
-      <result>
-         <error code="XTSE0260"/>
-      </result>
-   </test-case>
-
-   <test-case name="error-code-093">
-      <description>Error: xsl:include - not top-level</description>
-      <created by="Michael Kay" on="2012-11-07"/>
-      <environment ref="error001"/>
-      <dependencies>
-         <spec value="XSLT20+"/>
-      </dependencies>
-      <test>
-         <stylesheet file="error-code-093.xsl"/>
-      </test>
-      <result>
-         <any-of>
-            <error code="XTSE0010"/>
-            <error code="XTSE0170"/>
-         </any-of>
-      </result>
-   </test-case>
-
-   <test-case name="error-code-094">
-      <description>Error: xsl:include - self-referential</description>
-      <created by="Michael Kay" on="2012-11-07"/>
-      <modified by="Michael Kay" on="2012-12-11" change="see bug 20179"/>
-      <environment ref="error001"/>
-      <dependencies>
-         <spec value="XSLT20+"/>
-      </dependencies>
-      <test>
-         <stylesheet file="error-code-094.xsl"/>
-      </test>
-      <result>
-         <error code="XTSE0180"/>
-      </result>
-   </test-case>
-
-   <test-case name="error-code-095">
-      <description>Error: xsl:include - circular reference</description>
-      <created by="Michael Kay" on="2012-11-07"/>
-      <environment ref="error001"/>
-      <dependencies>
-         <spec value="XSLT20+"/>
-      </dependencies>
-      <test>
-         <stylesheet file="error-code-095.xsl"/>
-      </test>
-      <result>
-         <error code="XTSE0180"/>
-      </result>
-   </test-case>
-
-   <test-case name="error-code-096">
-      <description>Error: xsl:include - circular reference</description>
-      <created by="Michael Kay" on="2012-11-07"/>
-      <environment ref="error001"/>
-      <dependencies>
-         <spec value="XSLT20+"/>
-      </dependencies>
-      <test>
-         <stylesheet file="error-code-096.xsl"/>
-      </test>
-      <result>
-         <error code="XTSE0180"/>
-      </result>
-   </test-case>
-
-   <test-case name="error-code-097">
-      <description>Error: xsl:include - target is not a stylesheet</description>
-      <created by="Michael Kay" on="2012-11-07"/>
-      <environment ref="error001"/>
-      <dependencies>
-         <spec value="XSLT20+"/>
-      </dependencies>
-      <test>
-         <stylesheet file="error-code-097.xsl"/>
-      </test>
-      <result>
-         <any-of>
-            <error code="XTSE0150"/>
-            <error code="XTSE0165"/>
-         </any-of>
-      </result>
-   </test-case>
-
-   <test-case name="error-code-098">
-      <description>Error: xsl:import - no href</description>
-      <created by="Michael Kay" on="2012-11-07"/>
-      <environment ref="error001"/>
-      <dependencies>
-         <spec value="XSLT20+"/>
-      </dependencies>
-      <test>
-         <stylesheet file="error-code-098.xsl"/>
-      </test>
-      <result>
-         <any-of>
-            <error code="XTSE0010"/>
-            <error code="XTSE0090"/>
-         </any-of>
-      </result>
-   </test-case>
-
-   <test-case name="error-code-099">
-      <description>Error: xsl:import - file does not exist</description>
-      <created by="Michael Kay" on="2012-11-07"/>
-      <environment ref="error001"/>
-      <dependencies>
-         <spec value="XSLT20+"/>
-      </dependencies>
-      <test>
-         <stylesheet file="error-code-099.xsl"/>
-      </test>
-      <result>
-         <error code="XTSE0165"/>
-      </result>
-   </test-case>
-
-   <test-case name="error-code-100">
-      <description>Error: xsl:import - invalid URL</description>
-      <created by="Michael Kay" on="2012-11-07"/>
-      <environment ref="error001"/>
-      <dependencies>
-         <spec value="XSLT20+"/>
-      </dependencies>
-      <test>
-         <stylesheet file="error-code-100.xsl"/>
-      </test>
-      <result>
-         <error code="XTSE0165"/>
-      </result>
-   </test-case>
-
-   <test-case name="error-code-101">
-      <description>Error: xsl:import - non-empty element</description>
-      <created by="Michael Kay" on="2012-11-07"/>
-      <environment ref="error001"/>
-      <dependencies>
-         <spec value="XSLT20+"/>
-      </dependencies>
-      <test>
-         <stylesheet file="error-code-101.xsl"/>
-      </test>
-      <result>
-         <error code="XTSE0260"/>
-      </result>
-   </test-case>
-
-   <test-case name="error-code-102">
-      <description>Error: xsl:import - not top-level</description>
-      <created by="Michael Kay" on="2012-11-07"/>
-      <environment ref="error001"/>
-      <dependencies>
-         <spec value="XSLT20+"/>
-      </dependencies>
-      <test>
-         <stylesheet file="error-code-102.xsl"/>
-      </test>
-      <result>
-         <any-of>
-            <error code="XTSE0010"/>
-            <error code="XTSE0190"/>
-         </any-of>
-      </result>
-   </test-case>
-
-   <test-case name="error-code-103">
-      <description>Error: xsl:import - self-referential</description>
-      <created by="Michael Kay" on="2012-11-07"/>
-      <environment ref="error001"/>
-      <dependencies>
-         <spec value="XSLT20+"/>
-      </dependencies>
-      <test>
-         <stylesheet file="error-code-103.xsl"/>
-      </test>
-      <result>
-         <error code="XTSE0210"/>
-      </result>
-   </test-case>
-
-   <test-case name="error-code-104">
-      <description>Error: xsl:import - circular reference</description>
-      <created by="Michael Kay" on="2012-11-07"/>
-      <environment ref="error001"/>
-      <dependencies>
-         <spec value="XSLT20+"/>
-      </dependencies>
-      <test>
-         <stylesheet file="error-code-104.xsl"/>
-      </test>
-      <result>
-         <error code="XTSE0210"/>
-      </result>
-   </test-case>
-
-   <test-case name="error-code-105">
-      <description>Error: xsl:import - circular reference</description>
-      <created by="Michael Kay" on="2012-11-07"/>
-      <environment ref="error001"/>
-      <dependencies>
-         <spec value="XSLT20+"/>
-      </dependencies>
-      <test>
-         <stylesheet file="error-code-105.xsl"/>
-      </test>
-      <result>
-         <error code="XTSE0210"/>
-      </result>
-   </test-case>
-
-   <test-case name="error-code-106">
-      <description>Error: xsl:import - not first top-level element</description>
-      <created by="Michael Kay" on="2012-11-07"/>
-      <environment ref="error001"/>
-      <dependencies>
-         <spec value="XSLT20+"/>
-      </dependencies>
-      <test>
-         <stylesheet file="error-code-106.xsl"/>
-      </test>
-      <result>
-         <error code="XTSE0200"/>
-      </result>
-   </test-case>
-
-   <test-case name="error-code-107">
-      <description>Error: xsl:import - target is not a stylesheet</description>
-      <created by="Michael Kay" on="2012-11-07"/>
-      <environment ref="error001"/>
-      <dependencies>
-         <spec value="XSLT20+"/>
-      </dependencies>
-      <test>
-         <stylesheet file="error-code-107.xsl"/>
-      </test>
-      <result>
-         <any-of>
-            <error code="XTSE0150"/>
-            <error code="XTSE0165"/>
-         </any-of>
-      </result>
-   </test-case>
-
-   <test-case name="error-code-108">
-      <description>Error: xsl:template - no match or name</description>
-      <created by="Michael Kay" on="2012-11-07"/>
-      <environment ref="error001"/>
-      <dependencies>
-         <spec value="XSLT20+"/>
-      </dependencies>
-      <test>
-         <stylesheet file="error-code-108.xsl"/>
-      </test>
-      <result>
-         <error code="XTSE0500"/>
-      </result>
-   </test-case>
-
-   <test-case name="error-code-109">
-      <description>Error: xsl:template - bad name</description>
-      <created by="Michael Kay" on="2012-11-07"/>
-      <environment ref="error001"/>
-      <dependencies>
-         <spec value="XSLT20+"/>
-      </dependencies>
-      <test>
-         <stylesheet file="error-code-109.xsl"/>
-      </test>
-      <result>
-         <error code="XTSE0020"/>
-      </result>
-   </test-case>
-
-   <test-case name="error-code-110">
-      <description>Error: xsl:template - bad pattern</description>
-      <created by="Michael Kay" on="2012-11-07"/>
-      <environment ref="error001"/>
-      <dependencies>
-         <spec value="XSLT20+"/>
-      </dependencies>
-      <test>
-         <stylesheet file="error-code-110.xsl"/>
-      </test>
-      <result>
-         <error code="XTSE0340"/>
-      </result>
-   </test-case>
-
-   <test-case name="error-code-111">
-      <description>Error: xsl:template - not top level</description>
-      <created by="Michael Kay" on="2012-11-07"/>
-      <environment ref="error001"/>
-      <dependencies>
-         <spec value="XSLT20+"/>
-      </dependencies>
-      <test>
-         <stylesheet file="error-code-111.xsl"/>
-      </test>
-      <result>
-         <error code="XTSE0010"/>
-      </result>
-   </test-case>
-
-   <test-case name="error-code-112">
-      <description>Error: xsl:template - extra attribute</description>
-      <created by="Michael Kay" on="2012-11-07"/>
-      <environment ref="error001"/>
-      <dependencies>
-         <spec value="XSLT20+"/>
-      </dependencies>
-      <test>
-         <stylesheet file="error-code-112.xsl"/>
-      </test>
-      <result>
-         <error code="XTSE0090"/>
-      </result>
-   </test-case>
-
-   <test-case name="error-code-113">
-      <description>Error: xsl:template - undeclared prefix</description>
-      <created by="Michael Kay" on="2012-11-07"/>
-      <environment ref="error001"/>
-      <dependencies>
-         <spec value="XSLT20+"/>
-      </dependencies>
-      <test>
-         <stylesheet file="error-code-113.xsl"/>
-      </test>
-      <result>
-         <error code="XTSE0280"/>
-      </result>
-   </test-case>
-
-   <test-case name="error-code-114">
-      <description>Error: xsl:template - duplicate name</description>
-      <created by="Michael Kay" on="2012-11-07"/>
-      <environment ref="error001"/>
-      <dependencies>
-         <spec value="XSLT20+"/>
-      </dependencies>
-      <test>
-         <stylesheet file="error-code-114.xsl"/>
-      </test>
-      <result>
-         <error code="XTSE0660"/>
-      </result>
-   </test-case>
-
-   <test-case name="error-code-115">
-      <description>Error: xsl:template - duplicate name</description>
-      <created by="Michael Kay" on="2012-11-07"/>
-      <environment ref="error001"/>
-      <dependencies>
-         <spec value="XSLT20+"/>
-      </dependencies>
-      <test>
-         <stylesheet file="error-code-115.xsl"/>
-      </test>
-      <result>
-         <error code="XTSE0660"/>
-      </result>
-   </test-case>
-
-   <test-case name="error-code-116">
-      <description>Error: xsl:template - bad content</description>
-      <created by="Michael Kay" on="2012-11-07"/>
-      <environment ref="error001"/>
-      <dependencies>
-         <spec value="XSLT20+"/>
-      </dependencies>
-      <test>
-         <stylesheet file="error-code-116.xsl"/>
-      </test>
-      <result>
-         <error code="XTSE0010"/>
-      </result>
-   </test-case>
-
-   <test-case name="error-code-117">
-      <description>Error: xsl:template - bad content</description>
-      <created by="Michael Kay" on="2012-11-07"/>
-      <environment ref="error001"/>
-      <dependencies>
-         <spec value="XSLT20+"/>
-      </dependencies>
-      <test>
-         <stylesheet file="error-code-117.xsl"/>
-      </test>
-      <result>
-         <error code="XTSE0010"/>
-      </result>
-   </test-case>
-
-   <test-case name="error-code-118">
-      <description>Error: xsl:template - bad mode name</description>
-      <created by="Michael Kay" on="2012-11-07"/>
-      <environment ref="error001"/>
-      <dependencies>
-         <spec value="XSLT20+"/>
-      </dependencies>
-      <test>
-         <stylesheet file="error-code-118.xsl"/>
-      </test>
-      <result>
-         <error code="XTSE0550"/>
-      </result>
-   </test-case>
-
-   <test-case name="error-code-119">
-      <description>Error: xsl:call-template - bad template name</description>
-      <created by="Michael Kay" on="2012-11-07"/>
-      <environment ref="error001"/>
-      <dependencies>
-         <spec value="XSLT20+"/>
-      </dependencies>
-      <test>
-         <stylesheet file="error-code-119.xsl"/>
-      </test>
-      <result>
-         <error code="XTSE0020"/>
-      </result>
-   </test-case>
-
-   <test-case name="error-code-120">
-      <description>Error: xsl:call-template - bad template name prefix</description>
-      <created by="Michael Kay" on="2012-11-07"/>
-      <environment ref="error001"/>
-      <dependencies>
-         <spec value="XSLT20+"/>
-      </dependencies>
-      <test>
-         <stylesheet file="error-code-120.xsl"/>
-      </test>
-      <result>
-         <error code="XTSE0280"/>
-      </result>
-   </test-case>
-
-   <test-case name="error-code-121">
-      <description>Error: xsl:call-template - unknown template name</description>
-      <created by="Michael Kay" on="2012-11-07"/>
-      <environment ref="error001"/>
-      <dependencies>
-         <spec value="XSLT20+"/>
-      </dependencies>
-      <test>
-         <stylesheet file="error-code-121.xsl"/>
-      </test>
-      <result>
-         <error code="XTSE0650"/>
-      </result>
-   </test-case>
-
-   <test-case name="error-code-122">
-      <description>Error: xsl:call-template - omitted template name</description>
-      <created by="Michael Kay" on="2012-11-07"/>
-      <environment ref="error001"/>
-      <dependencies>
-         <spec value="XSLT20+"/>
-      </dependencies>
-      <test>
-         <stylesheet file="error-code-122.xsl"/>
-      </test>
-      <result>
-         <error code="XTSE0010"/>
-      </result>
-   </test-case>
-
-   <test-case name="error-code-123">
-      <description>Error: xsl:call-template - extra attribute</description>
-      <created by="Michael Kay" on="2012-11-07"/>
-      <environment ref="error001"/>
-      <dependencies>
-         <spec value="XSLT20+"/>
-      </dependencies>
-      <test>
-         <stylesheet file="error-code-123.xsl"/>
-      </test>
-      <result>
-         <any-of>
-            <error code="XTSE0010"/>
-            <error code="XTSE0090"/>
-         </any-of>
-      </result>
-   </test-case>
-
-   <test-case name="error-code-124">
-      <description>Error: xsl:call-template - must be in a template body</description>
-      <created by="Michael Kay" on="2012-11-07"/>
-      <environment ref="error001"/>
-      <dependencies>
-         <spec value="XSLT20+"/>
-      </dependencies>
-      <test>
-         <stylesheet file="error-code-124.xsl"/>
-      </test>
-      <result>
-         <error code="XTSE0010"/>
-      </result>
-   </test-case>
-
-   <test-case name="error-code-125">
-      <description>Error: xsl:call-template - bad content</description>
-      <created by="Michael Kay" on="2012-11-07"/>
-      <environment ref="error001"/>
-      <dependencies>
-         <spec value="XSLT20+"/>
-      </dependencies>
-      <test>
-         <stylesheet file="error-code-125.xsl"/>
-      </test>
-      <result>
-         <error code="XTSE0010"/>
-      </result>
-   </test-case>
-
-   <test-case name="error-code-126">
-      <description>Error: xsl:call-template - duplicate parameters</description>
-      <created by="Michael Kay" on="2012-11-07"/>
-      <environment ref="error001"/>
-      <dependencies>
-         <spec value="XSLT20+"/>
-      </dependencies>
-      <test>
-         <stylesheet file="error-code-126.xsl"/>
-      </test>
-      <result>
-         <error code="XTSE0670"/>
-      </result>
-   </test-case>
-
-   <test-case name="error-code-127">
-      <description>Error: xsl:call-template - duplicate parameters</description>
-      <created by="Michael Kay" on="2012-11-07"/>
-      <environment ref="error001"/>
-      <dependencies>
-         <spec value="XSLT20+"/>
-      </dependencies>
-      <test>
-         <stylesheet file="error-code-127.xsl"/>
-      </test>
-      <result>
-         <error code="XTSE0670"/>
-      </result>
-   </test-case>
-
-   <test-case name="error-code-128">
-      <description>Error: xsl:call-template - bad content</description>
-      <created by="Michael Kay" on="2012-11-07"/>
-      <environment ref="error001"/>
-      <dependencies>
-         <spec value="XSLT20+"/>
-      </dependencies>
-      <test>
-         <stylesheet file="error-code-128.xsl"/>
-      </test>
-      <result>
-         <error code="XTSE0010"/>
-      </result>
-   </test-case>
-
-   <test-case name="error-code-129">
-      <description>Error: xsl:call-template - bad content</description>
-      <created by="Michael Kay" on="2012-11-07"/>
-      <environment ref="error001"/>
-      <dependencies>
-         <spec value="XSLT20+"/>
-      </dependencies>
-      <test>
-         <stylesheet file="error-code-129.xsl"/>
-      </test>
-      <result>
-         <error code="XTSE0010"/>
-      </result>
-   </test-case>
-
-   <test-case name="error-code-130">
-      <description>Error: xsl:apply-templates - node a node-set</description>
-      <created by="Michael Kay" on="2012-11-07"/>
-      <environment ref="error001"/>
-      <dependencies>
-         <spec value="XSLT20+"/>
-      </dependencies>
-      <test>
-         <stylesheet file="error-code-130.xsl"/>
-      </test>
-      <result>
-         <error code="XTTE0520"/>
-      </result>
-   </test-case>
-
-   <test-case name="error-code-131">
-      <description>Error: xsl:apply-templates - bad mode</description>
-      <created by="Michael Kay" on="2012-11-07"/>
-      <environment ref="error001"/>
-      <dependencies>
-         <spec value="XSLT20+"/>
-      </dependencies>
-      <test>
-         <stylesheet file="error-code-131.xsl"/>
-      </test>
-      <result>
-         <error code="XTSE0020"/>
-      </result>
-   </test-case>
-
-   <test-case name="error-code-132">
-      <description>Error: xsl:apply-templates - bad content</description>
-      <created by="Michael Kay" on="2012-11-07"/>
-      <environment ref="error001"/>
-      <dependencies>
-         <spec value="XSLT20+"/>
-      </dependencies>
-      <test>
-         <stylesheet file="error-code-132.xsl"/>
-      </test>
-      <result>
-         <error code="XTSE0010"/>
-      </result>
-   </test-case>
-
-   <test-case name="error-code-133">
-      <description>Error: xsl:apply-templates - duplicate params</description>
-      <created by="Michael Kay" on="2012-11-07"/>
-      <environment ref="error001"/>
-      <dependencies>
-         <spec value="XSLT20+"/>
-      </dependencies>
-      <test>
-         <stylesheet file="error-code-133.xsl"/>
-      </test>
-      <result>
-         <error code="XTSE0670"/>
-      </result>
-   </test-case>
-
-   <test-case name="error-code-134">
-      <description>Error: xsl:apply-templates - extra attribute</description>
-      <created by="Michael Kay" on="2012-11-07"/>
-      <environment ref="error001"/>
-      <dependencies>
-         <spec value="XSLT20+"/>
-      </dependencies>
-      <test>
-         <stylesheet file="error-code-134.xsl"/>
-      </test>
-      <result>
-         <error code="XTSE0090"/>
-      </result>
-   </test-case>
-
-   <test-case name="error-code-135">
-      <description>Error: xsl:apply-templates - top-level</description>
-      <created by="Michael Kay" on="2012-11-07"/>
-      <environment ref="error001"/>
-      <dependencies>
-         <spec value="XSLT20+"/>
-      </dependencies>
-      <test>
-         <stylesheet file="error-code-135.xsl"/>
-      </test>
-      <result>
-         <error code="XTSE0010"/>
-      </result>
-   </test-case>
-
-   <test-case name="error-code-136">
-      <description>Error: xsl:variable - bad name</description>
-      <created by="Michael Kay" on="2012-11-07"/>
-      <environment ref="error001"/>
-      <dependencies>
-         <spec value="XSLT20+"/>
-      </dependencies>
-      <test>
-         <stylesheet file="error-code-136.xsl"/>
-      </test>
-      <result>
-         <error code="XTSE0020"/>
-      </result>
-   </test-case>
-
-   <test-case name="error-code-137">
-      <description>Error: xsl:for-each - xsl:sort must come first</description>
-      <created by="Michael Kay" on="2012-11-07"/>
-      <environment ref="error001"/>
-      <dependencies>
-         <spec value="XSLT20+"/>
-      </dependencies>
-      <test>
-         <stylesheet file="error-code-137.xsl"/>
-      </test>
-      <result>
-         <error code="XTSE0010"/>
-      </result>
-   </test-case>
-
-   <test-case name="error-code-138">
-      <description>Error: xsl:with-param - misspelt</description>
-      <created by="Michael Kay" on="2012-11-07"/>
-      <environment ref="error001"/>
-      <dependencies>
-         <spec value="XSLT20+"/>
-      </dependencies>
-      <test>
-         <stylesheet file="error-code-138.xsl"/>
-      </test>
-      <result>
-         <error code="XTSE0010"/>
-      </result>
-   </test-case>
-
-   <test-case name="error-code-139">
-      <description>Error: xsl:variable - duplicate name</description>
-      <created by="Michael Kay" on="2012-11-07"/>
-      <environment ref="error001"/>
-      <dependencies>
-         <spec value="XSLT20+"/>
-      </dependencies>
-      <test>
-         <stylesheet file="error-code-139.xsl"/>
-      </test>
-      <result>
-         <error code="XTSE0630"/>
-      </result>
-   </test-case>
-
-   <test-case name="error-code-140">
-      <description>Error: xsl:variable - no name</description>
-      <created by="Michael Kay" on="2012-11-07"/>
-      <environment ref="error001"/>
-      <dependencies>
-         <spec value="XSLT20+"/>
-      </dependencies>
-      <test>
-         <stylesheet file="error-code-140.xsl"/>
-      </test>
-      <result>
-         <error code="XTSE0010"/>
-      </result>
-   </test-case>
-
-   <test-case name="error-code-141">
-      <description>Error: xsl:variable - select attribute plus content</description>
-      <created by="Michael Kay" on="2012-11-07"/>
-      <environment ref="error001"/>
-      <dependencies>
-         <spec value="XSLT20+"/>
-      </dependencies>
-      <test>
-         <stylesheet file="error-code-141.xsl"/>
-      </test>
-      <result>
-         <error code="XTSE0620"/>
-      </result>
-   </test-case>
-
-   <test-case name="error-code-142">
-      <description>Error: xsl:param - wrong position</description>
-      <created by="Michael Kay" on="2012-11-07"/>
-      <environment ref="error001"/>
-      <dependencies>
-         <spec value="XSLT20+"/>
-      </dependencies>
-      <test>
-         <stylesheet file="error-code-142.xsl"/>
-      </test>
-      <result>
-         <error code="XTSE0010"/>
-      </result>
-   </test-case>
-
-   <test-case name="error-code-143">
-      <description>Error: xsl:param - wrong position</description>
-      <created by="Michael Kay" on="2012-11-07"/>
-      <environment ref="error001"/>
-      <dependencies>
-         <spec value="XSLT20+"/>
-      </dependencies>
-      <test>
-         <stylesheet file="error-code-143.xsl"/>
-      </test>
-      <result>
-         <error code="XTSE0010"/>
-      </result>
-   </test-case>
-
-   <test-case name="error-code-144">
-      <description>Error: xsl:variable - self-reference</description>
-      <created by="Michael Kay" on="2012-11-07"/>
-      <environment ref="error001"/>
-      <dependencies>
-         <spec value="XSLT20+"/>
-      </dependencies>
-      <test>
-         <stylesheet file="error-code-144.xsl"/>
-      </test>
-      <result>
-         <error code="XPST0008"/>
-      </result>
-   </test-case>
-
-   <test-case name="error-code-145">
-      <description>Error: xsl:variable - self-reference</description>
-      <created by="Michael Kay" on="2012-11-07"/>
-      <environment ref="error001"/>
-      <dependencies>
-         <spec value="XSLT20+"/>
-      </dependencies>
-      <test>
-         <stylesheet file="error-code-145.xsl"/>
-      </test>
-      <result>
-         <error code="XTDE0640"/>
-      </result>
-   </test-case>
-
-   <test-case name="error-code-146">
-      <description>Error: xsl:variable - circular reference</description>
-      <created by="Michael Kay" on="2012-11-07"/>
-      <environment ref="error001"/>
-      <dependencies>
-         <spec value="XSLT20+"/>
-      </dependencies>
-      <test>
-         <stylesheet file="error-code-146.xsl"/>
-      </test>
-      <result>
-         <error code="XTDE0640"/>
-      </result>
-   </test-case>
-
-   <test-case name="error-code-147">
-      <description>Error: text at top level</description>
-      <created by="Michael Kay" on="2012-11-07"/>
-      <environment ref="error001"/>
-      <dependencies>
-         <spec value="XSLT20+"/>
-      </dependencies>
-      <test>
-         <stylesheet file="error-code-147.xsl"/>
-      </test>
-      <result>
-         <error code="XTSE0120"/>
-      </result>
-   </test-case>
-
-   <test-case name="error-code-148">
-      <description>Error: xsl:strip-space with misspelled attribute</description>
-      <created by="Michael Kay" on="2012-11-07"/>
-      <environment ref="error001"/>
-      <dependencies>
-         <spec value="XSLT20+"/>
-      </dependencies>
-      <test>
-         <stylesheet file="error-code-148.xsl"/>
-      </test>
-      <result>
-         <any-of>
-            <error code="XTSE0010"/>
-            <error code="XTSE0090"/>
-         </any-of>
-      </result>
-   </test-case>
-
-   <test-case name="error-code-149">
-      <description>Test that PI names may NOT contain a colon (see Namespaces REC section 6)</description>
-      <created by="Michael Kay" on="2012-11-07"/>
-      <environment ref="error001"/>
-      <dependencies>
-         <spec value="XSLT20+"/>
-      </dependencies>
-      <test>
-         <stylesheet file="error-code-149.xsl"/>
-      </test>
-      <result>
-         <error code="XTSE0340"/>
-      </result>
-   </test-case>
-
-   <test-case name="error-code-150">
-      <description>Error: xsl:variable - duplicate name</description>
-      <created by="Michael Kay" on="2012-11-07"/>
-      <environment ref="error001"/>
-      <dependencies>
-         <spec value="XSLT20+"/>
-      </dependencies>
-      <test>
-         <stylesheet file="error-code-150.xsl"/>
-      </test>
-      <result>
-         <error code="XTSE0630"/>
-      </result>
-   </test-case>
-
-   <test-case name="error-code-151">
-      <description>Error: invliad top-level XSLT element</description>
-      <created by="Michael Kay" on="2012-11-07"/>
-      <environment ref="error001"/>
-      <dependencies>
-         <spec value="XSLT20+"/>
-      </dependencies>
-      <test>
-         <stylesheet file="error-code-151.xsl"/>
-      </test>
-      <result>
-         <error code="XTSE0010"/>
-      </result>
-   </test-case>
-
-   <test-case name="error-code-152">
-      <description>Test validation when version matches supported version. This stylesheet should flag an error.</description>
-      <created by="Michael Kay" on="2012-11-07"/>
-      <environment ref="error001"/>
-      <dependencies>
-         <spec value="XSLT20+"/>
-      </dependencies>
-      <test>
-         <stylesheet file="error-code-152.xsl"/>
-      </test>
-      <result>
-         <error code="XTSE0010"/>
-      </result>
-   </test-case>
-
-   <test-case name="error-code-153">
-      <description>Test validation when version is lower than supported version. This stylesheet should flag an error.</description>
-      <created by="Michael Kay" on="2012-11-07"/>
-      <environment ref="error001"/>
-      <dependencies>
-         <spec value="XSLT20+"/>
-      </dependencies>
-      <test>
-         <stylesheet file="error-code-153.xsl"/>
-      </test>
-      <result>
-         <error code="XTSE0010"/>
-      </result>
-   </test-case>
-
-   <test-case name="error-code-154">
-      <description>BUG: 5.4.1/008 DESCRIPTION: No error is reported if xsl:text or xsl:value-of is used at the top level of the stylesheet.</description>
-      <created by="Michael Kay" on="2012-11-07"/>
-      <environment ref="error001"/>
-      <dependencies>
-         <spec value="XSLT20+"/>
-      </dependencies>
-      <test>
-         <stylesheet file="error-code-154.xsl"/>
-      </test>
-      <result>
-         <error code="XTSE0010"/>
-      </result>
-   </test-case>
-
-   <test-case name="error-code-155">
-      <description>Test "treat as" failure on simple values. the next two are known at compile time here are some that aren't known until run-time</description>
-      <created by="Michael Kay" on="2012-11-07"/>
-      <environment ref="error001"/>
-      <dependencies>
-         <spec value="XSLT20+"/>
-      </dependencies>
-      <test>
-         <stylesheet file="error-code-155.xsl"/>
-      </test>
-      <result>
-         <error code="XPDY0050"/>
-      </result>
-   </test-case>
-
-   <test-case name="error-code-156">
-      <description>Test "treat as" failure on simple values. here are some that aren't known until run-time</description>
-      <created by="Michael Kay" on="2012-11-07"/>
-      <environment ref="error001"/>
-      <dependencies>
-         <spec value="XSLT20+"/>
-      </dependencies>
-      <test>
-         <stylesheet file="error-code-156.xsl"/>
-      </test>
-      <result>
-         <error code="XPDY0050"/>
-      </result>
-   </test-case>
-
-   <test-case name="error-code-157">
-      <description>Test "treat as" cardinality failure on simple values.</description>
-      <created by="Michael Kay" on="2012-11-07"/>
-      <environment ref="error001"/>
-      <dependencies>
-         <spec value="XSLT20+"/>
-      </dependencies>
-      <test>
-         <stylesheet file="error-code-157.xsl"/>
-      </test>
-      <result>
-         <error code="XPDY0050"/>
-      </result>
-   </test-case>
-
-   <test-case name="error-code-158">
-      <description>Test "treat as" on sequences. treat-as failure: 13th item in list is a string, not a decimal</description>
-      <created by="Michael Kay" on="2012-11-07"/>
-      <environment ref="error001"/>
-      <dependencies>
-         <spec value="XSLT20+"/>
-      </dependencies>
-      <test>
-         <stylesheet file="error-code-158.xsl"/>
-      </test>
-      <result>
-         <error code="XPDY0050"/>
-      </result>
-   </test-case>
-
-   <test-case name="error-code-159">
-      <description>XPath 2.0: invalid date and time.</description>
-      <created by="Michael Kay" on="2012-11-07"/>
-      <environment ref="error001"/>
-      <dependencies>
-         <spec value="XSLT20+"/>
-      </dependencies>
-      <test>
-         <stylesheet file="error-code-159.xsl"/>
-      </test>
-      <result>
-         <error code="FORG0001"/>
-      </result>
-   </test-case>
-
-   <test-case name="error-code-160">
-      <description>tests syntax error in a regular expression.</description>
-      <created by="Michael Kay" on="2012-11-07"/>
-      <environment ref="error001"/>
-      <dependencies>
-         <spec value="XSLT20+"/>
-      </dependencies>
-      <test>
-         <stylesheet file="error-code-160.xsl"/>
-      </test>
-      <result>
-         <error code="FORX0002"/>
-      </result>
-   </test-case>
-
-   <test-case name="error-code-161">
-      <description>Test no xsl:fallback for an unknown extension element.</description>
-      <created by="Michael Kay" on="2012-11-07"/>
-      <environment ref="error001"/>
-      <dependencies>
-         <spec value="XSLT20+"/>
-      </dependencies>
-      <test>
-         <stylesheet file="error-code-161.xsl"/>
-      </test>
-      <result>
-         <error code="XTDE1450"/>
-      </result>
-   </test-case>
-
-   <test-case name="error-code-162">
-      <description>Test integer division by zero (XPath 2.0)</description>
-      <created by="Michael Kay" on="2012-11-07"/>
-      <environment ref="error001"/>
-      <dependencies>
-         <spec value="XSLT20+"/>
-      </dependencies>
-      <test>
-         <stylesheet file="error-code-162.xsl"/>
-      </test>
-      <result>
-         <error code="FOAR0001"/>
-      </result>
-   </test-case>
-
-   <test-case name="error-code-163">
-      <description>XPath 2.0: test min/max on a heterogeneous sequence</description>
-      <created by="Michael Kay" on="2012-11-07"/>
-      <environment ref="error001"/>
-      <dependencies>
-         <spec value="XSLT20+"/>
-      </dependencies>
-      <test>
-         <stylesheet file="error-code-163.xsl"/>
-      </test>
-      <result>
-         <error code="FORG0006"/>
-      </result>
-   </test-case>
-
-   <test-case name="error-code-164">
-      <description>Test error() function with no arguments</description>
-      <created by="Michael Kay" on="2012-11-07"/>
-      <environment ref="error001"/>
-      <dependencies>
-         <spec value="XSLT20+"/>
-      </dependencies>
-      <test>
-         <stylesheet file="error-code-164.xsl"/>
-      </test>
-      <result>
-         <error code="FOER0000"/>
-      </result>
-   </test-case>
-
-   <test-case name="error-code-165">
-      <description>Test error() function with a string arguments</description>
-      <created by="Michael Kay" on="2012-11-07"/>
-      <environment ref="error001"/>
-      <dependencies>
-         <spec value="XSLT20+"/>
-      </dependencies>
-      <test>
-         <stylesheet file="error-code-165.xsl"/>
-      </test>
-      <result>
-         <error code="XPTY0004"/>
-      </result>
-   </test-case>
-
-   <test-case name="error-code-166">
-      <description>test for disabling output escaping in nested xsl:text now an error, XSLT 2.0 no longer allows nested xsl:text</description>
-      <created by="Michael Kay" on="2012-11-07"/>
-      <environment ref="error001"/>
-      <dependencies>
-         <spec value="XSLT20+"/>
-         <feature value="disabling_output_escaping"/>
-      </dependencies>
-      <test>
-         <stylesheet file="error-code-166.xsl"/>
-      </test>
-      <result>
-         <error code="XTSE0010"/>
-      </result>
-   </test-case>
-
-   <test-case name="error-code-167">
-      <description>Test how sum() handles a mixed sequence</description>
-      <created by="Michael Kay" on="2012-11-07"/>
-      <environment ref="error001"/>
-      <dependencies>
-         <spec value="XSLT20+"/>
-      </dependencies>
-      <test>
-         <stylesheet file="error-code-167.xsl"/>
-      </test>
-      <result>
-         <error code="FORG0006"/>
-      </result>
-   </test-case>
-
-   <test-case name="error-code-168">
-      <description>Type error in argument to a function call</description>
-      <created by="Michael Kay" on="2012-11-07"/>
-      <environment ref="error001"/>
-      <dependencies>
-         <spec value="XSLT20+"/>
-      </dependencies>
-      <test>
-         <stylesheet file="error-code-168.xsl"/>
-      </test>
-      <result>
-         <error code="XPTY0004"/>
-      </result>
-   </test-case>
-
-   <test-case name="error-code-169">
-      <description>Type error in argument to arithmetic operator</description>
-      <created by="Michael Kay" on="2012-11-07"/>
-      <environment ref="error001"/>
-      <dependencies>
-         <spec value="XSLT20+"/>
-      </dependencies>
-      <test>
-         <stylesheet file="error-code-169.xsl"/>
-      </test>
-      <result>
-         <error code="XPTY0004"/>
-      </result>
-   </test-case>
-
-   <test-case name="error-code-170">
-      <description>Type error in equality comparison</description>
-      <created by="Michael Kay" on="2012-11-07"/>
-      <environment ref="error001"/>
-      <dependencies>
-         <spec value="XSLT20+"/>
-      </dependencies>
-      <test>
-         <stylesheet file="error-code-170.xsl"/>
-      </test>
-      <result>
-         <error code="XPTY0004"/>
-      </result>
-   </test-case>
-
-   <test-case name="error-code-171">
-      <description>DOCUMENT: http://www.w3.org/TR/xpath SECTION: 3.4 Booleans Test of "=" operator with mixed types String to number comparison is not allowed except in backwards compatibility mode</description>
-      <created by="Michael Kay" on="2012-11-07"/>
-      <environment ref="error001"/>
-      <dependencies>
-         <spec value="XSLT20+"/>
-      </dependencies>
-      <test>
-         <stylesheet file="error-code-171.xsl"/>
-      </test>
-      <result>
-         <error code="XPTY0004"/>
-      </result>
-   </test-case>
-
-   <test-case name="error-code-172">
-      <description>Test xsl:result-document with unknown format</description>
-      <created by="Michael Kay" on="2012-11-07"/>
-      <environment ref="error001"/>
-      <dependencies>
-         <spec value="XSLT20+"/>
-      </dependencies>
-      <test>
-         <stylesheet file="error-code-172.xsl"/>
-      </test>
-      <result>
-         <error code="XTDE1460"/>
-      </result>
-   </test-case>
-
-   <test-case name="error-code-173">
-      <description>error in included stylesheet</description>
-      <created by="Michael Kay" on="2012-11-07"/>
-      <environment ref="error001"/>
-      <dependencies>
-         <spec value="XSLT20+"/>
-      </dependencies>
-      <test>
-         <stylesheet file="error-code-173.xsl"/>
-      </test>
-      <result>
-         <error code="XTSE0165"/>
-      </result>
-   </test-case>
-
-   <test-case name="error-code-174">
-      <description>xsl:stylesheet not at top level</description>
-      <created by="Michael Kay" on="2012-11-07"/>
-      <environment ref="error001"/>
-      <dependencies>
-         <spec value="XSLT20+"/>
-      </dependencies>
-      <test>
-         <stylesheet file="error-code-174.xsl"/>
-      </test>
-      <result>
-         <error code="XTSE0010"/>
-      </result>
-   </test-case>
-
-   <test-case name="error-code-175">
-      <description>unknown top-level element in XSLT namespace</description>
-      <created by="Michael Kay" on="2012-11-07"/>
-      <environment ref="error001"/>
-      <dependencies>
-         <spec value="XSLT20+"/>
-      </dependencies>
-      <test>
-         <stylesheet file="error-code-175.xsl"/>
-      </test>
-      <result>
-         <error code="XTSE0010"/>
-      </result>
-   </test-case>
-
-   <test-case name="error-code-176">
-      <description>variable declared as child of xsl:apply-imports</description>
-      <created by="Michael Kay" on="2012-11-07"/>
-      <environment ref="error001"/>
-      <dependencies>
-         <spec value="XSLT20+"/>
-      </dependencies>
-      <test>
-         <stylesheet file="error-code-176.xsl"/>
-      </test>
-      <result>
-         <error code="XTSE0010"/>
-      </result>
-   </test-case>
-
-   <test-case name="error-code-177">
-      <description>Deeply nested dynamic error</description>
-      <created by="Michael Kay" on="2012-11-07"/>
-      <environment ref="error001"/>
-      <dependencies>
-         <spec value="XSLT20+"/>
-      </dependencies>
-      <test>
-         <stylesheet file="error-code-177.xsl"/>
-      </test>
-      <result>
-         <error code="FOAR0001"/>
-      </result>
-   </test-case>
-
-   <test-case name="error-code-178">
-      <description>"." used when undefined - type error detected statically or dynamically</description>
-      <created by="Michael Kay" on="2012-11-07"/>
-      <environment ref="error001"/>
-      <dependencies>
-         <spec value="XSLT20+"/>
-      </dependencies>
-      <test>
-         <stylesheet file="error-code-178.xsl"/>
-      </test>
-      <result>
-         <error code="XPDY0002"/>
-      </result>
-   </test-case>
-
-   <test-case name="error-code-179">
-      <description>"." used when undefined - type error detected statically or dynamically</description>
-      <created by="Michael Kay" on="2012-11-07"/>
-      <environment ref="error001"/>
-      <dependencies>
-         <spec value="XSLT20+"/>
-      </dependencies>
-      <test>
-         <stylesheet file="error-code-179.xsl"/>
-      </test>
-      <result>
-         <error code="XPDY0002"/>
-      </result>
-   </test-case>
-
-   <test-case name="error-code-180">
-      <description>axis step used when context item is not a node - type error detected statically or dynamically</description>
-      <created by="Michael Kay" on="2012-11-07"/>
-      <environment ref="error001"/>
-      <dependencies>
-         <spec value="XSLT20+"/>
-      </dependencies>
-      <test>
-         <stylesheet file="error-code-180.xsl"/>
-      </test>
-      <result>
-         <error code="XPTY0020"/>
-      </result>
-   </test-case>
-
-   <test-case name="error-code-181">
-      <description>"." used when not a node - static error even though never executed</description>
-      <created by="Michael Kay" on="2012-11-07"/>
-      <environment ref="error001"/>
-      <dependencies>
-         <spec value="XSLT20"/>
-      </dependencies>
-      <test>
-         <stylesheet file="error-code-181.xsl"/>
-      </test>
-      <result>
-         <any-of>
-            <assert-xml><![CDATA[<a>***** error not detected! *****</a>]]></assert-xml>
-            <error code="XTTE0520"/>
-         </any-of>
-      </result>
-   </test-case>
-
-   <test-case name="error-code-182">
-      <description>"." used when not a node - optionally a static error even though never executed</description>
-      <created by="Michael Kay" on="2012-11-07"/>
-      <environment ref="error001"/>
-      <dependencies>
-         <spec value="XSLT20+"/>
-      </dependencies>
-      <test>
-         <stylesheet file="error-code-182.xsl"/>
-      </test>
-      <result>
-         <error code="XPTY0004"/>
-      </result>
-   </test-case>
-
-   <test-case name="error-code-183">
-      <description>"." used when not a node - static error even though never executed</description>
-      <created by="Michael Kay" on="2012-11-07"/>
-      <environment ref="error001"/>
-      <dependencies>
-         <spec value="XSLT20+"/>
-      </dependencies>
-      <test>
-         <stylesheet file="error-code-183.xsl"/>
-      </test>
-      <result>
-         <error code="XPTY0020"/>
-      </result>
-   </test-case>
-
-   <test-case name="error-code-184">
-      <description>unclosed expression in AVT</description>
-      <created by="Michael Kay" on="2012-11-07"/>
-      <environment ref="error001"/>
-      <dependencies>
-         <spec value="XSLT20+"/>
-      </dependencies>
-      <test>
-         <stylesheet file="error-code-184.xsl"/>
-      </test>
-      <result>
-         <error code="XTSE0350"/>
-      </result>
-   </test-case>
-
-   <test-case name="error-code-185a">
-      <description>test reporting of dynamic errors in a simplified stylesheet</description>
-      <created by="Michael Kay" on="2012-11-07"/>
-      <environment ref="error001"/>
-      <dependencies>
-         <spec value="XSLT20+"/>
-         <ignore-doc-failure value="false"/>
-      </dependencies>
-      <test>
-         <stylesheet file="error-code-185.xsl"/>
-      </test>
-      <result>
-         <any-of>
-            <error code="FODC0002"/>
-            <error code="FODC0005"/>
-         </any-of>
-      </result>
-   </test-case>
-   
-   <test-case name="error-code-185b">
-      <description>test reporting of dynamic errors in a simplified stylesheet</description>
-      <created by="Michael Kay" on="2012-11-07"/>
-      <environment ref="error001"/>
-      <dependencies>
-         <spec value="XSLT20+"/>
-         <ignore-doc-failure value="true"/>
-      </dependencies>
-      <test>
-         <stylesheet file="error-code-185.xsl"/>
-      </test>
-      <result>
-         <assert-xml><![CDATA[<root/>]]></assert-xml>
-      </result>
-   </test-case>
-
-   <test-case name="error-code-186">
-      <description>Test xsl:result-document writing twice to same destination</description>
-      <created by="Michael Kay" on="2012-11-07"/>
-      <environment ref="error001"/>
-      <dependencies>
-         <spec value="XSLT20+"/>
-      </dependencies>
-      <test>
-         <stylesheet file="error-code-186.xsl"/>
-      </test>
-      <result>
-         <error code="XTDE1490"/>
-      </result>
-   </test-case>
-
-   <test-case name="error-code-187">
-      <description>this succeeds in 1.0, with top-down construction, but is should fail in 2.0 with bottom up construction. Note that the xsl:copy is copying a document node which can't have an attribute.</description>
-      <created by="Michael Kay" on="2012-11-07"/>
-      <environment ref="error001"/>
-      <dependencies>
-         <spec value="XSLT20+"/>
-      </dependencies>
-      <test>
-         <stylesheet file="error-code-187.xsl"/>
-      </test>
-      <result>
-         <error code="XTDE0420"/>
-      </result>
-   </test-case>
-
-   <test-case name="error-code-188">
-      <description>tunnel='yes' not allowed on a stylesheet parameter</description>
-      <created by="Michael Kay" on="2012-11-07"/>
-      <environment ref="error001"/>
-      <dependencies>
-         <spec value="XSLT20+"/>
-      </dependencies>
-      <test>
-         <stylesheet file="error-code-188.xsl"/>
-      </test>
-      <result>
-         <error code="XTSE0020"/>
-      </result>
-   </test-case>
-
-   <test-case name="error-code-189">
-      <description>tunnel='yes' not allowed on a function parameter</description>
-      <created by="Michael Kay" on="2012-11-07"/>
-      <environment ref="error001"/>
-      <dependencies>
-         <spec value="XSLT20+"/>
-      </dependencies>
-      <test>
-         <stylesheet file="error-code-189.xsl"/>
-      </test>
-      <result>
-         <error code="XTSE0020"/>
-      </result>
-   </test-case>
-
-   <test-case name="error-code-190">
-      <description>TEST conflicting xsl:namespace declarations</description>
-      <created by="Michael Kay" on="2012-11-07"/>
-      <environment ref="error001"/>
-      <dependencies>
-         <spec value="XSLT20+"/>
-      </dependencies>
-      <test>
-         <stylesheet file="error-code-190.xsl"/>
-      </test>
-      <result>
-         <error code="XTSE0810"/>
-      </result>
-   </test-case>
-
-   <test-case name="error-code-191">
-      <description>Error: xsl:template - undefined key in pattern</description>
-      <created by="Michael Kay" on="2012-11-07"/>
-      <environment ref="error152"/>
-      <dependencies>
-         <spec value="XSLT20+"/>
-      </dependencies>
-      <test>
-         <stylesheet file="error-code-191.xsl"/>
-      </test>
-      <result>
-         <error code="XTDE1260"/>
-      </result>
-   </test-case>
-
-   <test-case name="error-code-192">
-      <description>two range variables, both have the same name this is actually allowed; but $i/@val gives an error because the context item isn't a node</description>
-      <created by="Michael Kay" on="2012-11-07"/>
-      <environment ref="error152"/>
-      <dependencies>
-         <spec value="XSLT20+"/>
-      </dependencies>
-      <test>
-         <stylesheet file="error-code-192.xsl"/>
-      </test>
-      <result>
-         <any-of>
-            <error code="XPTY0019"/>
-            <error code="XPTY0020"/>
-         </any-of>
-      </result>
-   </test-case>
-
-   <test-case name="error-code-193">
-      <description>Range variable used outside its scope</description>
-      <created by="Michael Kay" on="2012-11-07"/>
-      <environment ref="error152"/>
-      <dependencies>
-         <spec value="XSLT20+"/>
-      </dependencies>
-      <test>
-         <stylesheet file="error-code-193.xsl"/>
-      </test>
-      <result>
-         <error code="XPST0008"/>
-      </result>
-   </test-case>
-
-   <test-case name="error-code-194">
-      <description>Test use of a variable within a pattern causing a circularity (XSLT 2.0)</description>
-      <created by="Michael Kay" on="2012-11-07"/>
-      <environment>
-         <source role=".">
-            <content><![CDATA[<doc><param id="1"/><param id="2"/></doc>]]></content>
-         </source>
-      </environment>
-      <dependencies>
-         <spec value="XSLT20+"/>
-      </dependencies>
-      <test>
-         <stylesheet file="error-code-194.xsl"/>
-      </test>
-      <result>
-         <error code="XTDE0640"/>
-      </result>
-   </test-case>
-
-   <test-case name="error-code-195">
-      <description>Test use of variables in a key match pattern (XSLT 2.0) causing a circularity.
-      Result disputed for XSLT 3.0: see bug 26543</description>
-      <created by="Michael Kay" on="2012-11-07"/>
-      <environment ref="error214"/>
-      <dependencies>
-         <spec value="XSLT20+"/>
-      </dependencies>
-      <test>
-         <stylesheet file="error-code-195.xsl"/>
-      </test>
-      <result>
-         <error code="XTDE0640"/>
-      </result>
-   </test-case>
-
-   <test-case name="error-code-196">
-      <description>Test use of variables in a key use expression (XSLT 2.0) causing a circularity</description>
-      <created by="Michael Kay" on="2012-11-07"/>
-      <environment ref="error214"/>
-      <dependencies>
-         <spec value="XSLT20+"/>
-      </dependencies>
-      <test>
-         <stylesheet file="error-code-196.xsl"/>
-      </test>
-      <result>
-         <error code="XTDE0640"/>
-      </result>
-   </test-case>
-
-   <test-case name="error-code-197">
-      <description>Test use of key() in a key use expression (XSLT 2.0) with circular definitions</description>
-      <created by="Michael Kay" on="2012-11-07"/>
-      <environment ref="error214"/>
-      <dependencies>
-         <spec value="XSLT20+"/>
-      </dependencies>
-      <test>
-         <stylesheet file="error-code-197.xsl"/>
-      </test>
-      <result>
-         <error code="XTDE0640"/>
-      </result>
-   </test-case>
-
-   <test-case name="error-code-198">
-      <description>type-check contents of a template rule against the type of the context item (could be detected statically by inference from the match pattern, but dynamic reporting is also allowed)</description>
-      <created by="Michael Kay" on="2012-11-07"/>
-      <environment ref="error001"/>
-      <dependencies>
-         <spec value="XSLT20+"/>
-      </dependencies>
-      <test>
-         <stylesheet file="error-code-198.xsl"/>
-      </test>
-      <result>
-         <error code="XTTE0570"/>
-      </result>
-   </test-case>
-
-   <test-case name="error-code-199">
-      <description>Generate error XTSE0010</description>
-      <created by="Michael Kay" on="2012-11-07"/>
-      <environment ref="error001"/>
-      <dependencies>
-         <spec value="XSLT20+"/>
-      </dependencies>
-      <test>
-         <stylesheet file="error-code-199.xsl"/>
-      </test>
-      <result>
-         <error code="XTSE0010"/>
-      </result>
-   </test-case>
-
-   <test-case name="error-code-200">
-      <description>xsl:stylesheet element in wrong position</description>
-      <created by="Michael Kay" on="2012-11-07"/>
-      <environment ref="error001"/>
-      <dependencies>
-         <spec value="XSLT20+"/>
-      </dependencies>
-      <test>
-         <stylesheet file="error-code-200.xsl"/>
-      </test>
-      <result>
-         <error code="XTSE0010"/>
-      </result>
-   </test-case>
-
-   <test-case name="error-code-201">
-      <description>Generate error XTSE0020</description>
-      <created by="Michael Kay" on="2012-11-07"/>
-      <environment ref="error001"/>
-      <dependencies>
-         <spec value="XSLT20+"/>
-      </dependencies>
-      <test>
-         <stylesheet file="error-code-201.xsl"/>
-      </test>
-      <result>
-         <error code="XTSE0020"/>
-      </result>
-   </test-case>
-
-   <test-case name="error-code-202">
-      <description>Generate error XTDE0030</description>
-      <created by="Michael Kay" on="2012-11-07"/>
-      <environment ref="error001"/>
-      <dependencies>
-         <spec value="XSLT20+"/>
-      </dependencies>
-      <test>
-         <stylesheet file="error-code-202.xsl"/>
-         <initial-template name="main"/>
-      </test>
-      <result>
-         <error code="XTDE0030"/>
-      </result>
-   </test-case>
-
-   <test-case name="error-code-203">
-      <description>Generate error XTDE0050</description>
-      <created by="Michael Kay" on="2012-11-07"/>
-      <environment ref="error001"/>
-      <dependencies>
-         <spec value="XSLT20+"/>
-      </dependencies>
-      <test>
-         <stylesheet file="error-code-203.xsl"/>
-         <initial-template name="main"/>
-      </test>
-      <result>
-         <error code="XTDE0050"/>
-      </result>
-   </test-case>
-
-   <test-case name="error-code-204">
-      <description>Generate error XTDE0060</description>
-      <created by="Michael Kay" on="2012-11-07"/>
-      <environment ref="error001"/>
-      <dependencies>
-         <spec value="XSLT20+"/>
-      </dependencies>
-      <test>
-         <stylesheet file="error-code-204.xsl"/>
-         <initial-template name="main"/>
-      </test>
-      <result>
-         <error code="XTDE0060"/>
-      </result>
-   </test-case>
-
-   <test-case name="error-code-205">
-      <description>Generate error XPDY0002</description>
-      <created by="Michael Kay" on="2012-11-07"/>
-      <environment ref="error001"/>
-      <dependencies>
-         <spec value="XSLT20+"/>
-      </dependencies>
-      <test>
-         <stylesheet file="error-code-205.xsl"/>
-         <initial-template name="main"/>
-      </test>
-      <result>
-         <error code="XPDY0002"/>
-      </result>
-   </test-case>
-
-   <test-case name="error-code-206">
-      <description>Generate error XTSE0080</description>
-      <created by="Michael Kay" on="2012-11-07"/>
-      <environment ref="error001"/>
-      <dependencies>
-         <spec value="XSLT20+"/>
-      </dependencies>
-      <test>
-         <stylesheet file="error-code-206.xsl"/>
-      </test>
-      <result>
-         <error code="XTSE0080"/>
-      </result>
-   </test-case>
-
-   <test-case name="error-code-207">
-      <description>Generate error XTSE0090</description>
-      <created by="Michael Kay" on="2012-11-07"/>
-      <environment ref="error001"/>
-      <dependencies>
-         <spec value="XSLT20+"/>
-      </dependencies>
-      <test>
-         <stylesheet file="error-code-207.xsl"/>
-         <initial-template name="main"/>
-      </test>
-      <result>
-         <error code="XTSE0090"/>
-      </result>
-   </test-case>
-
-   <test-case name="error-code-208">
-      <description>Generate error XTSE0110</description>
-      <created by="Michael Kay" on="2012-11-07"/>
-      <environment ref="error001"/>
-      <dependencies>
-         <spec value="XSLT20+"/>
-      </dependencies>
-      <test>
-         <stylesheet file="error-code-208.xsl"/>
-         <initial-template name="main"/>
-      </test>
-      <result>
-         <error code="XTSE0110"/>
-      </result>
-   </test-case>
-
-   <test-case name="error-code-209">
-      <description>Generate error XTSE0120</description>
-      <created by="Michael Kay" on="2012-11-07"/>
-      <environment ref="error001"/>
-      <dependencies>
-         <spec value="XSLT20+"/>
-      </dependencies>
-      <test>
-         <stylesheet file="error-code-209.xsl"/>
-         <initial-template name="main"/>
-      </test>
-      <result>
-         <error code="XTSE0120"/>
-      </result>
-   </test-case>
-
-   <test-case name="error-code-210">
-      <description>Generate error XTSE0125</description>
-      <created by="Michael Kay" on="2012-11-07"/>
-      <environment ref="error001"/>
-      <dependencies>
-         <spec value="XSLT20+"/>
-      </dependencies>
-      <test>
-         <stylesheet file="error-code-210.xsl"/>
-         <initial-template name="main"/>
-      </test>
-      <result>
-         <error code="XTSE0125"/>
-      </result>
-   </test-case>
-
-   <test-case name="error-code-211">
-      <description>Generate error XTSE0130</description>
-      <created by="Michael Kay" on="2012-11-07"/>
-      <environment ref="error001"/>
-      <dependencies>
-         <spec value="XSLT20+"/>
-      </dependencies>
-      <test>
-         <stylesheet file="error-code-211.xsl"/>
-         <initial-template name="main"/>
-      </test>
-      <result>
-         <error code="XTSE0130"/>
-      </result>
-   </test-case>
-
-   <test-case name="error-code-212">
-      <description>Generate error XTSE0200</description>
-      <created by="Michael Kay" on="2012-11-07"/>
-      <environment ref="error001"/>
-      <dependencies>
-         <spec value="XSLT20+"/>
-      </dependencies>
-      <test>
-         <stylesheet file="error-code-212.xsl"/>
-         <initial-template name="main"/>
-      </test>
-      <result>
-         <error code="XTSE0200"/>
-      </result>
-   </test-case>
-
-   <test-case name="error-code-213">
-      <description>Generate error XTSE0150</description>
-      <created by="Michael Kay" on="2012-11-07"/>
-      <environment ref="error001"/>
-      <dependencies>
-         <spec value="XSLT20+"/>
-      </dependencies>
-      <test>
-         <stylesheet file="error-code-213.xsl"/>
-      </test>
-      <result>
-         <error code="XTSE0150"/>
-      </result>
-   </test-case>
-
-   <test-case name="error-code-214">
-      <description>Generate error XTSE0165</description>
-      <created by="Michael Kay" on="2012-11-07"/>
-      <environment ref="error001"/>
-      <dependencies>
-         <spec value="XSLT20+"/>
-      </dependencies>
-      <test>
-         <stylesheet file="error-code-214.xsl"/>
-         <initial-template name="main"/>
-      </test>
-      <result>
-         <error code="XTSE0165"/>
-      </result>
-   </test-case>
-
-   <test-case name="error-code-215">
-      <description>Generate error XTSE0165. Note this involves reading a document that is not a valid stylesheet module, so there will always be an alternative of reporting the error in that module, in this case XTSE0150.</description>
-      <created by="Michael Kay" on="2012-11-07"/>
-      <environment ref="error001"/>
-      <dependencies>
-         <spec value="XSLT20+"/>
-      </dependencies>
-      <test>
-         <stylesheet file="error-code-215.xsl"/>
-         <initial-template name="main"/>
-      </test>
-      <result>
-         <any-of>
-            <error code="XTSE0165"/>
-            <error code="XTSE0150"/>
-         </any-of>
-      </result>
-   </test-case>
-
-   <test-case name="error-code-216">
-      <description>Generate error XTSE0170</description>
-      <created by="Michael Kay" on="2012-11-07"/>
-      <environment ref="error001"/>
-      <dependencies>
-         <spec value="XSLT20+"/>
-      </dependencies>
-      <test>
-         <stylesheet file="error-code-216.xsl"/>
-         <initial-template name="main"/>
-      </test>
-      <result>
-         <error code="XTSE0170"/>
-      </result>
-   </test-case>
-
-   <test-case name="error-code-217">
-      <description>Generate error XTSE0180</description>
-      <created by="Michael Kay" on="2012-11-07"/>
-      <environment ref="error001"/>
-      <dependencies>
-         <spec value="XSLT20+"/>
-      </dependencies>
-      <test>
-         <stylesheet file="error-code-217.xsl"/>
-         <initial-template name="main"/>
-      </test>
-      <result>
-         <error code="XTSE0180"/>
-      </result>
-   </test-case>
-
-   <test-case name="error-code-218">
-      <description>Generate error XTSE0180</description>
-      <created by="Michael Kay" on="2012-11-07"/>
-      <environment ref="error001"/>
-      <dependencies>
-         <spec value="XSLT20+"/>
-      </dependencies>
-      <test>
-         <stylesheet file="error-code-218.xsl"/>
-      </test>
-      <result>
-         <error code="XTSE0180"/>
-      </result>
-   </test-case>
-
-   <test-case name="error-code-219">
-      <description>Generate error XTSE0180</description>
-      <created by="Michael Kay" on="2012-11-07"/>
-      <environment ref="error001"/>
-      <dependencies>
-         <spec value="XSLT20+"/>
-      </dependencies>
-      <test>
-         <stylesheet file="error-code-219.xsl"/>
-      </test>
-      <result>
-         <error code="XTSE0180"/>
-      </result>
-   </test-case>
-
-   <test-case name="error-code-220">
-      <description>Generate error XTSE0190</description>
-      <created by="Michael Kay" on="2012-11-07"/>
-      <environment ref="error001"/>
-      <dependencies>
-         <spec value="XSLT20+"/>
-      </dependencies>
-      <test>
-         <stylesheet file="error-code-220.xsl"/>
-         <initial-template name="main"/>
-      </test>
-      <result>
-         <error code="XTSE0190"/>
-      </result>
-   </test-case>
-
-   <test-case name="error-code-221">
-      <description>Generate error XTSE0200</description>
-      <created by="Michael Kay" on="2012-11-07"/>
-      <environment ref="error001"/>
-      <dependencies>
-         <spec value="XSLT20+"/>
-      </dependencies>
-      <test>
-         <stylesheet file="error-code-221.xsl"/>
-         <initial-template name="main"/>
-      </test>
-      <result>
-         <error code="XTSE0200"/>
-      </result>
-   </test-case>
-
-   <test-case name="error-code-222">
-      <description>Generate error XTSE0210</description>
-      <created by="Michael Kay" on="2012-11-07"/>
-      <environment ref="error001"/>
-      <dependencies>
-         <spec value="XSLT20+"/>
-      </dependencies>
-      <test>
-         <stylesheet file="error-code-222.xsl"/>
-         <initial-template name="main"/>
-      </test>
-      <result>
-         <error code="XTSE0210"/>
-      </result>
-   </test-case>
-
-   <test-case name="error-code-223">
-      <description>Generate error XTSE0210</description>
-      <created by="Michael Kay" on="2012-11-07"/>
-      <environment ref="error001"/>
-      <dependencies>
-         <spec value="XSLT20+"/>
-      </dependencies>
-      <test>
-         <stylesheet file="error-code-223.xsl"/>
-         <initial-template name="main"/>
-      </test>
-      <result>
-         <error code="XTSE0210"/>
-      </result>
-   </test-case>
-
-   <test-case name="error-code-224">
-      <description>Generate error XTSE0210</description>
-      <created by="Michael Kay" on="2012-11-07"/>
-      <environment ref="error001"/>
-      <dependencies>
-         <spec value="XSLT20+"/>
-      </dependencies>
-      <test>
-         <stylesheet file="error-code-224.xsl"/>
-         <initial-template name="main"/>
-      </test>
-      <result>
-         <error code="XTSE0210"/>
-      </result>
-   </test-case>
-
-   <test-case name="error-code-225">
-      <description>Generate error XTSE0220</description>
-      <created by="Michael Kay" on="2012-11-07"/>
-      <environment ref="error001"/>
-      <dependencies>
-         <spec value="XSLT20+"/>
-         <feature value="schema_aware"/>
-      </dependencies>
-      <test>
-         <stylesheet file="error-code-225.xsl"/>
-         <initial-template name="main"/>
-      </test>
-      <result>
-         <error code="XTSE0220"/>
-      </result>
-   </test-case>
-
-   <test-case name="error-code-226">
-      <description>Generate error XTSE0260</description>
-      <created by="Michael Kay" on="2012-11-07"/>
-      <environment ref="error001"/>
-      <dependencies>
-         <spec value="XSLT20+"/>
-      </dependencies>
-      <test>
-         <stylesheet file="error-code-226.xsl"/>
-         <initial-template name="main"/>
-      </test>
-      <result>
-         <error code="XTSE0260"/>
-      </result>
-   </test-case>
-
-   <test-case name="error-code-227">
-      <description>Generate error XTSE0260</description>
-      <created by="Michael Kay" on="2012-11-07"/>
-      <environment ref="error001"/>
-      <dependencies>
-         <spec value="XSLT20+"/>
-      </dependencies>
-      <test>
-         <stylesheet file="error-code-227.xsl"/>
-         <initial-template name="main"/>
-      </test>
-      <result>
-         <error code="XTSE0260"/>
-      </result>
-   </test-case>
-
-   <test-case name="error-code-228">
-      <description>Generate error XTSE0265</description>
-      <created by="Michael Kay" on="2012-11-07"/>
-      <environment ref="error001"/>
-      <dependencies>
-         <spec value="XSLT20+"/>
-      </dependencies>
-      <test>
-         <stylesheet file="error-code-228.xsl"/>
-         <stylesheet file="error-code-228a.xsl" role="secondary"/>
-         <initial-template name="main"/>
-      </test>
-      <result>
-         <error code="XTSE0265"/>
-      </result>
-   </test-case>
-
-   <test-case name="error-code-229a">
-      <description>Generate error XTRE0270</description>
-      <created by="Michael Kay" on="2012-11-07"/>
-      <environment ref="error001"/>
-      <dependencies>
-         <spec value="XSLT20"/>
-         <on-multiple-match value="error"/>
-      </dependencies>
-      <test>
-         <stylesheet file="error-code-229.xsl"/>
-         <initial-template name="main"/>
-      </test>
-      <result>
-         <error code="XTRE0270"/>
-      </result>
-   </test-case>
-   
-   <test-case name="error-code-229b">
-      <description>Recover from error XTRE0270</description>
-      <created by="Michael Kay" on="2012-11-07"/>
-      <environment ref="error001"/>
-      <dependencies>
-         <spec value="XSLT20"/>
-         <on-multiple-match value="recover"/>
-      </dependencies>
-      <test>
-         <stylesheet file="error-code-229.xsl"/>
-         <initial-template name="main"/>
-      </test>
-      <result>
-         <assert-xml><![CDATA[<out>2</out>]]></assert-xml>
-      </result>
-   </test-case>
-   
-   <test-case name="error-code-229c">
-      <description>Generate error XTSE0270: two statically-conflicting strip-space/preserve-space declarations</description>
-      <created by="Michael Kay" on="2012-11-07"/>
-      <environment ref="error001"/>
-      <dependencies>
-         <spec value="XSLT30+"/>
-      </dependencies>
-      <test>
-         <stylesheet file="error-code-229.xsl"/>
-         <initial-template name="main"/>
-      </test>
-      <result>
-         <error code="XTSE0270"/>
-      </result>
-   </test-case>
-   
-
-   <test-case name="error-code-231">
-      <description>Generate error XTSE0280</description>
-      <created by="Michael Kay" on="2012-11-07"/>
-      <environment ref="error001"/>
-      <dependencies>
-         <spec value="XSLT20+"/>
-      </dependencies>
-      <test>
-         <stylesheet file="error-code-231.xsl"/>
-      </test>
-      <result>
-         <error code="XTSE0280"/>
-      </result>
-   </test-case>
-
-   <test-case name="error-code-232">
-      <description>Generate error XTSE0340</description>
-      <created by="Michael Kay" on="2012-11-07"/>
-      <environment ref="error001"/>
-      <dependencies>
-         <spec value="XSLT20+"/>
-      </dependencies>
-      <test>
-         <stylesheet file="error-code-232.xsl"/>
-         <initial-template name="main"/>
-      </test>
-      <result>
-         <error code="XTSE0340"/>
-      </result>
-   </test-case>
-
-   <test-case name="error-code-233">
-      <description>Generate error XTSE0350</description>
-      <created by="Michael Kay" on="2012-11-07"/>
-      <environment ref="error001"/>
-      <dependencies>
-         <spec value="XSLT20+"/>
-      </dependencies>
-      <test>
-         <stylesheet file="error-code-233.xsl"/>
-         <initial-template name="main"/>
-      </test>
-      <result>
-         <error code="XTSE0350"/>
-      </result>
-   </test-case>
-
-   <test-case name="error-code-234">
-      <description>Generate error XTSE0370</description>
-      <created by="Michael Kay" on="2012-11-07"/>
-      <environment ref="error001"/>
-      <dependencies>
-         <spec value="XSLT20+"/>
-      </dependencies>
-      <test>
-         <stylesheet file="error-code-234.xsl"/>
-         <initial-template name="main"/>
-      </test>
-      <result>
-         <error code="XTSE0370"/>
-      </result>
-   </test-case>
-
-   <test-case name="error-code-235">
-      <description>Generate error XTDE0410</description>
-      <created by="Michael Kay" on="2012-11-07"/>
-      <environment ref="error001"/>
-      <dependencies>
-         <spec value="XSLT20+"/>
-      </dependencies>
-      <test>
-         <stylesheet file="error-code-235.xsl"/>
-         <initial-template name="main"/>
-      </test>
-      <result>
-         <error code="XTDE0410"/>
-      </result>
-   </test-case>
-
-   <test-case name="error-code-236">
-      <description>Generate error XTDE0420</description>
-      <created by="Michael Kay" on="2012-11-07"/>
-      <environment ref="error001"/>
-      <dependencies>
-         <spec value="XSLT20+"/>
-      </dependencies>
-      <test>
-         <stylesheet file="error-code-236.xsl"/>
-         <initial-template name="main"/>
-      </test>
-      <result>
-         <error code="XTDE0420"/>
-      </result>
-   </test-case>
-
-   <test-case name="error-code-237">
-      <description>Generate error XTDE0430</description>
-      <created by="Michael Kay" on="2012-11-07"/>
-      <environment ref="error001"/>
-      <dependencies>
-         <spec value="XSLT20+"/>
-      </dependencies>
-      <test>
-         <stylesheet file="error-code-237.xsl"/>
-         <initial-template name="main"/>
-      </test>
-      <result>
-         <error code="XTDE0430"/>
-      </result>
-   </test-case>
-
-   <test-case name="error-code-238">
-      <description>Generate error XTDE0440</description>
-      <created by="Michael Kay" on="2012-11-07"/>
-      <environment ref="error001"/>
-      <dependencies>
-         <spec value="XSLT20+"/>
-      </dependencies>
-      <test>
-         <stylesheet file="error-code-238.xsl"/>
-         <initial-template name="main"/>
-      </test>
-      <result>
-         <error code="XTDE0440"/>
-      </result>
-   </test-case>
-
-   <test-case name="error-code-239">
-      <description>Originally designed to generate error XTDE0485, but this was removed by erratum E16</description>
-      <created by="Michael Kay" on="2012-11-07"/>
-      <environment ref="error001"/>
-      <dependencies>
-         <spec value="XSLT20+"/>
-         <feature value="schema_aware"/>
-      </dependencies>
-      <test>
-         <stylesheet file="error-code-239.xsl"/>
-         <initial-template name="main"/>
-      </test>
-      <result>
-         <error code="XTTE1510"/>
-      </result>
-   </test-case>
-
-   <test-case name="error-code-240">
-      <description>Generate error XTSE0500</description>
-      <created by="Michael Kay" on="2012-11-07"/>
-      <environment ref="error001"/>
-      <dependencies>
-         <spec value="XSLT20+"/>
-      </dependencies>
-      <test>
-         <stylesheet file="error-code-240.xsl"/>
-         <initial-template name="main"/>
-      </test>
-      <result>
-         <error code="XTSE0500"/>
-      </result>
-   </test-case>
-
-   <test-case name="error-code-241">
-      <description>Generate error XTSE0500</description>
-      <created by="Michael Kay" on="2012-11-07"/>
-      <environment ref="error001"/>
-      <dependencies>
-         <spec value="XSLT20+"/>
-      </dependencies>
-      <test>
-         <stylesheet file="error-code-241.xsl"/>
-         <initial-template name="main"/>
-      </test>
-      <result>
-         <error code="XTSE0500"/>
-      </result>
-   </test-case>
-
-   <test-case name="error-code-242">
-      <description>Generate error XTSE0500</description>
-      <created by="Michael Kay" on="2012-11-07"/>
-      <environment ref="error001"/>
-      <dependencies>
-         <spec value="XSLT20+"/>
-      </dependencies>
-      <test>
-         <stylesheet file="error-code-242.xsl"/>
-         <initial-template name="main"/>
-      </test>
-      <result>
-         <error code="XTSE0500"/>
-      </result>
-   </test-case>
-
-   <test-case name="error-code-243">
-      <description>Generate error XTTE0510</description>
-      <created by="Michael Kay" on="2012-11-07"/>
-      <environment ref="error001"/>
-      <dependencies>
-         <spec value="XSLT20+"/>
-      </dependencies>
-      <test>
-         <stylesheet file="error-code-243.xsl"/>
-         <initial-template name="main"/>
-      </test>
-      <result>
-         <error code="XTTE0510"/>
-      </result>
-   </test-case>
-
-   <test-case name="error-code-244">
-      <description>Generate error XTTE0520</description>
-      <created by="Michael Kay" on="2012-11-07"/>
-      <environment ref="error001"/>
-      <dependencies>
-         <spec value="XSLT20+"/>
-      </dependencies>
-      <test>
-         <stylesheet file="error-code-244.xsl"/>
-         <initial-template name="main"/>
-      </test>
-      <result>
-         <error code="XTTE0520"/>
-      </result>
-   </test-case>
-
-   <test-case name="error-code-245">
-      <description>Generate error XTSE0530</description>
-      <created by="Michael Kay" on="2012-11-07"/>
-      <environment ref="error001"/>
-      <dependencies>
-         <spec value="XSLT20+"/>
-      </dependencies>
-      <test>
-         <stylesheet file="error-code-245.xsl"/>
-         <initial-template name="main"/>
-      </test>
-      <result>
-         <error code="XTSE0530"/>
-      </result>
-   </test-case>
-
-   <test-case name="error-code-246">
-      <description>Generate error XTRE0540</description>
-      <created by="Michael Kay" on="2012-11-07"/>
-      <environment ref="error001"/>
-      <dependencies>
-         <spec value="XSLT20"/>
-         <on-multiple-match value="error"/>
-      </dependencies>
-      <test>
-         <stylesheet file="error-code-246.xsl"/>
-         <initial-template name="main"/>
-      </test>
-      <result>
-         <error code="XTRE0540"/>
-      </result>
-   </test-case>
-
-   <test-case name="error-code-247">
-      <description>Generate error XTSE0550</description>
-      <created by="Michael Kay" on="2012-11-07"/>
-      <environment ref="error001"/>
-      <dependencies>
-         <spec value="XSLT20+"/>
-      </dependencies>
-      <test>
-         <stylesheet file="error-code-247.xsl"/>
-         <initial-template name="main"/>
-      </test>
-      <result>
-         <error code="XTSE0550"/>
-      </result>
-   </test-case>
-
-   <test-case name="error-code-248">
-      <description>Generate error XTSE0550</description>
-      <created by="Michael Kay" on="2012-11-07"/>
-      <environment ref="error001"/>
-      <dependencies>
-         <spec value="XSLT20+"/>
-      </dependencies>
-      <test>
-         <stylesheet file="error-code-248.xsl"/>
-         <initial-template name="main"/>
-      </test>
-      <result>
-         <error code="XTSE0550"/>
-      </result>
-   </test-case>
-
-   <test-case name="error-code-249">
-      <description>Generate error XTSE0550</description>
-      <created by="Michael Kay" on="2012-11-07"/>
-      <environment ref="error001"/>
-      <dependencies>
-         <spec value="XSLT20+"/>
-      </dependencies>
-      <test>
-         <stylesheet file="error-code-249.xsl"/>
-         <initial-template name="main"/>
-      </test>
-      <result>
-         <error code="XTSE0550"/>
-      </result>
-   </test-case>
-
-   <test-case name="error-code-250">
-      <description>Generate error XTSE0550</description>
-      <created by="Michael Kay" on="2012-11-07"/>
-      <environment ref="error001"/>
-      <dependencies>
-         <spec value="XSLT20+"/>
-      </dependencies>
-      <test>
-         <stylesheet file="error-code-250.xsl"/>
-         <initial-template name="main"/>
-      </test>
-      <result>
-         <error code="XTSE0550"/>
-      </result>
-   </test-case>
-
-   <test-case name="error-code-251">
-      <description>Generate error XTSE0550</description>
-      <created by="Michael Kay" on="2012-11-07"/>
-      <environment ref="error001"/>
-      <dependencies>
-         <spec value="XSLT20+"/>
-      </dependencies>
-      <test>
-         <stylesheet file="error-code-251.xsl"/>
-         <initial-template name="main"/>
-      </test>
-      <result>
-         <error code="XTSE0550"/>
-      </result>
-   </test-case>
-
-   <test-case name="error-code-252">
-      <description>Generate error XTDE0560</description>
-      <created by="Michael Kay" on="2012-11-07"/>
-      <environment ref="error001"/>
-      <dependencies>
-         <spec value="XSLT20+"/>
-      </dependencies>
-      <test>
-         <stylesheet file="error-code-252.xsl"/>
-         <initial-template name="main"/>
-      </test>
-      <result>
-         <error code="XTDE0560"/>
-      </result>
-   </test-case>
-
-   <test-case name="error-code-253">
-      <description>Generate error XTRE1500</description>
-      <created by="Michael Kay" on="2012-11-07"/>
-      <environment ref="error001"/>
-      <dependencies>
-         <spec value="XSLT20+"/>
-      </dependencies>
-      <test>
-         <stylesheet file="error-code-253.xsl"/>
-         <initial-template name="main"/>
-      </test>
-      <result>
-         <error code="XTDE0560"/>
-      </result>
-   </test-case>
-
-   <test-case name="error-code-254">
-      <description>Generate error XTTE0570</description>
-      <created by="Michael Kay" on="2012-11-07"/>
-      <environment ref="error001"/>
-      <dependencies>
-         <spec value="XSLT20+"/>
-      </dependencies>
-      <test>
-         <stylesheet file="error-code-254.xsl"/>
-         <initial-template name="main"/>
-      </test>
-      <result>
-         <error code="XTTE0570"/>
-      </result>
-   </test-case>
-
-   <test-case name="error-code-255">
-      <description>Generate error XTSE0580</description>
-      <created by="Michael Kay" on="2012-11-07"/>
-      <environment ref="error001"/>
-      <dependencies>
-         <spec value="XSLT20+"/>
-      </dependencies>
-      <test>
-         <stylesheet file="error-code-255.xsl"/>
-         <initial-template name="main"/>
-      </test>
-      <result>
-         <error code="XTSE0580"/>
-      </result>
-   </test-case>
-
-   <test-case name="error-code-256">
-      <description>Generate error XTSE0580</description>
-      <created by="Michael Kay" on="2012-11-07"/>
-      <environment ref="error001"/>
-      <dependencies>
-         <spec value="XSLT20+"/>
-      </dependencies>
-      <test>
-         <stylesheet file="error-code-256.xsl"/>
-         <initial-template name="main"/>
-      </test>
-      <result>
-         <error code="XTSE0580"/>
-      </result>
-   </test-case>
-
-   <test-case name="error-code-257">
-      <description>Generate error XTTE0590</description>
-      <created by="Michael Kay" on="2012-11-07"/>
-      <environment ref="error001"/>
-      <dependencies>
-         <spec value="XSLT20+"/>
-      </dependencies>
-      <test>
-         <stylesheet file="error-code-257.xsl"/>
-      </test>
-      <result>
-         <error code="XTTE0590"/>
-      </result>
-   </test-case>
-
-   <test-case name="error-code-258">
-      <description>Generate error XTTE0600</description>
-      <created by="Michael Kay" on="2012-11-07"/>
-      <environment ref="error001"/>
-      <dependencies>
-         <spec value="XSLT20+"/>
-      </dependencies>
-      <test>
-         <stylesheet file="error-code-258.xsl"/>
-         <initial-template name="main"/>
-      </test>
-      <result>
-         <error code="XTTE0600"/>
-      </result>
-   </test-case>
-
-   <test-case name="error-code-259">
-      <description>Generate error XTDE0610</description>
-      <created by="Michael Kay" on="2012-11-07"/>
-      <environment ref="error001"/>
-      <dependencies>
-         <spec value="XSLT20+"/>
-      </dependencies>
-      <test>
-         <stylesheet file="error-code-259.xsl"/>
-         <initial-template name="main"/>
-      </test>
-      <result>
-         <error code="XTDE0610"/>
-      </result>
-   </test-case>
-
-   <test-case name="error-code-260">
-      <description>Generate error XTSE0620</description>
-      <created by="Michael Kay" on="2012-11-07"/>
-      <environment ref="error001"/>
-      <dependencies>
-         <spec value="XSLT20+"/>
-      </dependencies>
-      <test>
-         <stylesheet file="error-code-260.xsl"/>
-         <initial-template name="main"/>
-      </test>
-      <result>
-         <error code="XTSE0620"/>
-      </result>
-   </test-case>
-
-   <test-case name="error-code-261">
-      <description>Generate error XTSE0630</description>
-      <created by="Michael Kay" on="2012-11-07"/>
-      <environment ref="error001"/>
-      <dependencies>
-         <spec value="XSLT20+"/>
-      </dependencies>
-      <test>
-         <stylesheet file="error-code-261.xsl"/>
-         <initial-template name="main"/>
-      </test>
-      <result>
-         <error code="XTSE0630"/>
-      </result>
-   </test-case>
-
-   <test-case name="error-code-262">
-      <description>Generate error XTDE0640</description>
-      <created by="Michael Kay" on="2012-11-07"/>
-      <environment ref="error001"/>
-      <dependencies>
-         <spec value="XSLT20+"/>
-      </dependencies>
-      <test>
-         <stylesheet file="error-code-262.xsl"/>
-         <initial-template name="main"/>
-      </test>
-      <result>
-         <error code="XTDE0640"/>
-      </result>
-   </test-case>
-
-   <test-case name="error-code-263">
-      <description>Generate error XTSE0650</description>
-      <created by="Michael Kay" on="2012-11-07"/>
-      <environment ref="error001"/>
-      <dependencies>
-         <spec value="XSLT20+"/>
-      </dependencies>
-      <test>
-         <stylesheet file="error-code-263.xsl"/>
-         <initial-template name="main"/>
-      </test>
-      <result>
-         <error code="XTSE0650"/>
-      </result>
-   </test-case>
-
-   <test-case name="error-code-264">
-      <description>Generate error XTSE0660</description>
-      <created by="Michael Kay" on="2012-11-07"/>
-      <environment ref="error001"/>
-      <dependencies>
-         <spec value="XSLT20+"/>
-      </dependencies>
-      <test>
-         <stylesheet file="error-code-264.xsl"/>
-         <initial-template name="main"/>
-      </test>
-      <result>
-         <error code="XTSE0660"/>
-      </result>
-   </test-case>
-
-   <test-case name="error-code-265">
-      <description>Generate error XTSE0670</description>
-      <created by="Michael Kay" on="2012-11-07"/>
-      <environment ref="error001"/>
-      <dependencies>
-         <spec value="XSLT20+"/>
-      </dependencies>
-      <test>
-         <stylesheet file="error-code-265.xsl"/>
-         <initial-template name="main"/>
-      </test>
-      <result>
-         <error code="XTSE0670"/>
-      </result>
-   </test-case>
-
-   <test-case name="error-code-266">
-      <description>Generate error XTSE0680</description>
-      <created by="Michael Kay" on="2012-11-07"/>
-      <environment ref="error001"/>
-      <dependencies>
-         <spec value="XSLT20+"/>
-      </dependencies>
-      <test>
-         <stylesheet file="error-code-266.xsl"/>
-         <initial-template name="main"/>
-      </test>
-      <result>
-         <error code="XTSE0680"/>
-      </result>
-   </test-case>
-
-   <test-case name="error-code-267">
-      <description>Generate error XTSE0690</description>
-      <created by="Michael Kay" on="2012-11-07"/>
-      <environment ref="error001"/>
-      <dependencies>
-         <spec value="XSLT20+"/>
-      </dependencies>
-      <test>
-         <stylesheet file="error-code-267.xsl"/>
-         <initial-template name="main"/>
-      </test>
-      <result>
-         <error code="XTSE0690"/>
-      </result>
-   </test-case>
-
-   <test-case name="error-code-268">
-      <description>Generate error XTDE0700</description>
-      <created by="Michael Kay" on="2012-11-07"/>
-      <environment ref="error001"/>
-      <dependencies>
-         <spec value="XSLT20+"/>
-      </dependencies>
-      <test>
-         <stylesheet file="error-code-268.xsl"/>
-      </test>
-      <result>
-         <error code="XTDE0700"/>
-      </result>
-   </test-case>
-
-   <test-case name="error-code-269">
-      <description>Generate error XTSE0710</description>
-      <created by="Michael Kay" on="2012-11-07"/>
-      <environment ref="error001"/>
-      <dependencies>
-         <spec value="XSLT20+"/>
-      </dependencies>
-      <test>
-         <stylesheet file="error-code-269.xsl"/>
-      </test>
-      <result>
-         <error code="XTSE0710"/>
-      </result>
-   </test-case>
-
-   <test-case name="error-code-270">
-      <description>Generate error XTSE0710</description>
-      <created by="Michael Kay" on="2012-11-07"/>
-      <environment ref="error001"/>
-      <dependencies>
-         <spec value="XSLT20+"/>
-      </dependencies>
-      <test>
-         <stylesheet file="error-code-270.xsl"/>
-      </test>
-      <result>
-         <error code="XTSE0710"/>
-      </result>
-   </test-case>
-
-   <test-case name="error-code-271">
-      <description>Generate error XTSE0720</description>
-      <created by="Michael Kay" on="2012-11-07"/>
-      <environment ref="error001"/>
-      <dependencies>
-         <spec value="XSLT20+"/>
-      </dependencies>
-      <test>
-         <stylesheet file="error-code-271.xsl"/>
-      </test>
-      <result>
-         <error code="XTSE0720"/>
-      </result>
-   </test-case>
-
-   <test-case name="error-code-272">
-      <description>Generate error XTSE0720</description>
-      <created by="Michael Kay" on="2012-11-07"/>
-      <environment ref="error001"/>
-      <dependencies>
-         <spec value="XSLT20+"/>
-      </dependencies>
-      <test>
-         <stylesheet file="error-code-272.xsl"/>
-      </test>
-      <result>
-         <error code="XTSE0720"/>
-      </result>
-   </test-case>
-
-   <test-case name="error-code-273">
-      <description>Generate error XTSE0740</description>
-      <created by="Michael Kay" on="2012-11-07"/>
-      <environment ref="error001"/>
-      <dependencies>
-         <spec value="XSLT20+"/>
-      </dependencies>
-      <test>
-         <stylesheet file="error-code-273.xsl"/>
-      </test>
-      <result>
-         <error code="XTSE0740"/>
-      </result>
-   </test-case>
-
-   <test-case name="error-code-274">
-      <description>Generate error XTSE0760</description>
-      <created by="Michael Kay" on="2012-11-07"/>
-      <environment ref="error001"/>
-      <dependencies>
-         <spec value="XSLT20+"/>
-      </dependencies>
-      <test>
-         <stylesheet file="error-code-274.xsl"/>
-      </test>
-      <result>
-         <error code="XTSE0760"/>
-      </result>
-   </test-case>
-
-   <test-case name="error-code-275">
-      <description>Generate error XTSE0760</description>
-      <created by="Michael Kay" on="2012-11-07"/>
-      <environment ref="error001"/>
-      <dependencies>
-         <spec value="XSLT20+"/>
-      </dependencies>
-      <test>
-         <stylesheet file="error-code-275.xsl"/>
-      </test>
-      <result>
-         <error code="XTSE0760"/>
-      </result>
-   </test-case>
-
-   <test-case name="error-code-276">
-      <description>Generate error XTSE0770</description>
-      <created by="Michael Kay" on="2012-11-07"/>
-      <environment ref="error001"/>
-      <dependencies>
-         <spec value="XSLT20+"/>
-      </dependencies>
-      <test>
-         <stylesheet file="error-code-276.xsl"/>
-      </test>
-      <result>
-         <error code="XTSE0770"/>
-      </result>
-   </test-case>
-
-   <test-case name="error-code-277">
-      <description>Generate error XTTE0780</description>
-      <created by="Michael Kay" on="2012-11-07"/>
-      <environment ref="error001"/>
-      <dependencies>
-         <spec value="XSLT20+"/>
-      </dependencies>
-      <test>
-         <stylesheet file="error-code-277.xsl"/>
-         <initial-template name="main"/>
-      </test>
-      <result>
-         <error code="XTTE0780"/>
-      </result>
-   </test-case>
-
-   <test-case name="error-code-278">
-      <description>Generate error XTTE0790</description>
-      <created by="Michael Kay" on="2012-11-07"/>
-      <environment ref="error001"/>
-      <dependencies>
-         <spec value="XSLT20+"/>
-      </dependencies>
-      <test>
-         <stylesheet file="error-code-278.xsl"/>
-         <initial-template name="main"/>
-      </test>
-      <result>
-         <error code="XTTE0790"/>
-      </result>
-   </test-case>
-
-   <test-case name="error-code-279">
-      <description>Generate error XTSE0805</description>
-      <created by="Michael Kay" on="2012-11-07"/>
-      <environment ref="error001"/>
-      <dependencies>
-         <spec value="XSLT20+"/>
-      </dependencies>
-      <test>
-         <stylesheet file="error-code-279.xsl"/>
-         <initial-template name="main"/>
-      </test>
-      <result>
-         <error code="XTSE0805"/>
-      </result>
-   </test-case>
-
-   <test-case name="error-code-280">
-      <description>Generate error XTSE0808</description>
-      <created by="Michael Kay" on="2012-11-07"/>
-      <environment ref="error001"/>
-      <dependencies>
-         <spec value="XSLT20+"/>
-      </dependencies>
-      <test>
-         <stylesheet file="error-code-280.xsl"/>
-         <initial-template name="main"/>
-      </test>
-      <result>
-         <error code="XTSE0808"/>
-      </result>
-   </test-case>
-
-   <test-case name="error-code-281">
-      <description>Generate error XTSE0809</description>
-      <created by="Michael Kay" on="2012-11-07"/>
-      <environment ref="error001"/>
-      <dependencies>
-         <spec value="XSLT20+"/>
-      </dependencies>
-      <test>
-         <stylesheet file="error-code-281.xsl"/>
-         <initial-template name="main"/>
-      </test>
-      <result>
-         <error code="XTSE0809"/>
-      </result>
-   </test-case>
-
-   <test-case name="error-code-282">
-      <description>Generate error XTSE0810</description>
-      <created by="Michael Kay" on="2012-11-07"/>
-      <environment ref="error001"/>
-      <dependencies>
-         <spec value="XSLT20+"/>
-      </dependencies>
-      <test>
-         <stylesheet file="error-code-282.xsl"/>
-         <initial-template name="main"/>
-      </test>
-      <result>
-         <error code="XTSE0810"/>
-      </result>
-   </test-case>
-
-   <test-case name="error-code-283">
-      <description>Generate error XTSE0812</description>
-      <created by="Michael Kay" on="2012-11-07"/>
-      <environment ref="error001"/>
-      <dependencies>
-         <spec value="XSLT20+"/>
-      </dependencies>
-      <test>
-         <stylesheet file="error-code-283.xsl"/>
-         <initial-template name="main"/>
-      </test>
-      <result>
-         <error code="XTSE0812"/>
-      </result>
-   </test-case>
-
-   <test-case name="error-code-284">
-      <description>Generate error XTDE0820</description>
-      <created by="Michael Kay" on="2012-11-07"/>
-      <environment ref="error001"/>
-      <dependencies>
-         <spec value="XSLT20+"/>
-      </dependencies>
-      <test>
-         <stylesheet file="error-code-284.xsl"/>
-         <initial-template name="main"/>
-      </test>
-      <result>
-         <error code="XTDE0820"/>
-      </result>
-   </test-case>
-
-   <test-case name="error-code-285">
-      <description>Generate error XTDE0830</description>
-      <created by="Michael Kay" on="2012-11-07"/>
-      <environment ref="error001"/>
-      <dependencies>
-         <spec value="XSLT20+"/>
-      </dependencies>
-      <test>
-         <stylesheet file="error-code-285.xsl"/>
-         <initial-template name="main"/>
-      </test>
-      <result>
-         <error code="XTDE0830"/>
-      </result>
-   </test-case>
-
-   <test-case name="error-code-286">
-      <description>Generate error XTDE0835</description>
-      <created by="Michael Kay" on="2012-11-07"/>
-      <environment ref="error001"/>
-      <dependencies>
-         <spec value="XSLT20+"/>
-      </dependencies>
-      <test>
-         <stylesheet file="error-code-286.xsl"/>
-         <initial-template name="main"/>
-      </test>
-      <result>
-         <error code="XTDE0835"/>
-      </result>
-   </test-case>
-
-   <test-case name="error-code-287">
-      <description>Generate error XTSE0840</description>
-      <created by="Michael Kay" on="2012-11-07"/>
-      <environment ref="error001"/>
-      <dependencies>
-         <spec value="XSLT20+"/>
-      </dependencies>
-      <test>
-         <stylesheet file="error-code-287.xsl"/>
-         <initial-template name="main"/>
-      </test>
-      <result>
-         <error code="XTSE0840"/>
-      </result>
-   </test-case>
-
-   <test-case name="error-code-288">
-      <description>Generate error XTDE0850</description>
-      <created by="Michael Kay" on="2012-11-07"/>
-      <environment ref="error001"/>
-      <dependencies>
-         <spec value="XSLT20+"/>
-      </dependencies>
-      <test>
-         <stylesheet file="error-code-288.xsl"/>
-         <initial-template name="main"/>
-      </test>
-      <result>
-         <error code="XTDE0850"/>
-      </result>
-   </test-case>
-
-   <test-case name="error-code-289">
-      <description>Generate error XTDE0855</description>
-      <created by="Michael Kay" on="2012-11-07"/>
-      <environment ref="error001"/>
-      <dependencies>
-         <spec value="XSLT20+"/>
-      </dependencies>
-      <test>
-         <stylesheet file="error-code-289.xsl"/>
-         <initial-template name="main"/>
-      </test>
-      <result>
-         <error code="XTDE0855"/>
-      </result>
-   </test-case>
-
-   <test-case name="error-code-290">
-      <description>Generate error XTDE0860</description>
-      <created by="Michael Kay" on="2012-11-07"/>
-      <environment ref="error001"/>
-      <dependencies>
-         <spec value="XSLT20+"/>
-      </dependencies>
-      <test>
-         <stylesheet file="error-code-290.xsl"/>
-         <initial-template name="main"/>
-      </test>
-      <result>
-         <error code="XTDE0860"/>
-      </result>
-   </test-case>
-
-   <test-case name="error-code-291">
-      <description>Generate error XTDE0865</description>
-      <created by="Michael Kay" on="2012-11-07"/>
-      <environment ref="error001"/>
-      <dependencies>
-         <spec value="XSLT20+"/>
-      </dependencies>
-      <test>
-         <stylesheet file="error-code-291.xsl"/>
-         <initial-template name="main"/>
-      </test>
-      <result>
-         <error code="XTDE0865"/>
-      </result>
-   </test-case>
-
-   <test-case name="error-code-292">
-      <description>Generate error XTSE0870</description>
-      <created by="Michael Kay" on="2012-11-07"/>
-      <environment ref="error001"/>
-      <dependencies>
-         <spec value="XSLT20+"/>
-      </dependencies>
-      <test>
-         <stylesheet file="error-code-292.xsl"/>
-         <initial-template name="main"/>
-      </test>
-      <result>
-         <error code="XTSE0870"/>
-      </result>
-   </test-case>
-
-   <test-case name="error-code-293">
-      <description>Generate error XTSE0880</description>
-      <created by="Michael Kay" on="2012-11-07"/>
-      <environment ref="error001"/>
-      <dependencies>
-         <spec value="XSLT20+"/>
-      </dependencies>
-      <test>
-         <stylesheet file="error-code-293.xsl"/>
-         <initial-template name="main"/>
-      </test>
-      <result>
-         <error code="XTSE0880"/>
-      </result>
-   </test-case>
-
-   <test-case name="error-code-294">
-      <description>Generate error XTDE0890</description>
-      <created by="Michael Kay" on="2012-11-07"/>
-      <environment ref="error001"/>
-      <dependencies>
-         <spec value="XSLT20+"/>
-      </dependencies>
-      <test>
-         <stylesheet file="error-code-294.xsl"/>
-         <initial-template name="main"/>
-      </test>
-      <result>
-         <error code="XTDE0890"/>
-      </result>
-   </test-case>
-
-   <test-case name="error-code-295">
-      <description>Generate error XTDE0890</description>
-      <created by="Michael Kay" on="2012-11-07"/>
-      <environment ref="error001"/>
-      <dependencies>
-         <spec value="XSLT20+"/>
-      </dependencies>
-      <test>
-         <stylesheet file="error-code-295.xsl"/>
-         <initial-template name="main"/>
-      </test>
-      <result>
-         <error code="XTDE0890"/>
-      </result>
-   </test-case>
-
-   <test-case name="error-code-296">
-      <description>Generate error XTDE0905</description>
-      <created by="Michael Kay" on="2012-11-07"/>
-      <environment ref="error001"/>
-      <dependencies>
-         <spec value="XSLT20+"/>
-      </dependencies>
-      <test>
-         <stylesheet file="error-code-296.xsl"/>
-         <initial-template name="main"/>
-      </test>
-      <result>
-         <error code="XTDE0905"/>
-      </result>
-   </test-case>
-
-   <test-case name="error-code-297">
-      <description>Generate error XTSE0910</description>
-      <created by="Michael Kay" on="2012-11-07"/>
-      <environment ref="error001"/>
-      <dependencies>
-         <spec value="XSLT20+"/>
-      </dependencies>
-      <test>
-         <stylesheet file="error-code-297.xsl"/>
-         <initial-template name="main"/>
-      </test>
-      <result>
-         <error code="XTSE0910"/>
-      </result>
-   </test-case>
-
-   <test-case name="error-code-298">
-      <description>Generate error XTDE0920</description>
-      <created by="Michael Kay" on="2012-11-07"/>
-      <environment ref="error001"/>
-      <dependencies>
-         <spec value="XSLT20+"/>
-      </dependencies>
-      <test>
-         <stylesheet file="error-code-298.xsl"/>
-         <initial-template name="main"/>
-      </test>
-      <result>
-         <error code="XTDE0920"/>
-      </result>
-   </test-case>
-
-   <test-case name="error-code-299">
-      <description>Generate error XTDE0920</description>
-      <created by="Michael Kay" on="2012-11-07"/>
-      <environment ref="error001"/>
-      <dependencies>
-         <spec value="XSLT20+"/>
-      </dependencies>
-      <test>
-         <stylesheet file="error-code-299.xsl"/>
-         <initial-template name="main"/>
-      </test>
-      <result>
-         <error code="XTDE0920"/>
-      </result>
-   </test-case>
-
-   <test-case name="error-code-300">
-      <description>Generate error XTDE0925</description>
-      <created by="Michael Kay" on="2012-11-07"/>
-      <environment ref="error001"/>
-      <dependencies>
-         <spec value="XSLT20+"/>
-      </dependencies>
-      <test>
-         <stylesheet file="error-code-300.xsl"/>
-         <initial-template name="main"/>
-      </test>
-      <result>
-         <error code="XTDE0925"/>
-      </result>
-   </test-case>
-
-   <test-case name="error-code-301">
-      <description>Generate error XTDE0925</description>
-      <created by="Michael Kay" on="2012-11-07"/>
-      <environment ref="error001"/>
-      <dependencies>
-         <spec value="XSLT20+"/>
-      </dependencies>
-      <test>
-         <stylesheet file="error-code-301.xsl"/>
-         <initial-template name="main"/>
-      </test>
-      <result>
-         <error code="XTDE0925"/>
-      </result>
-   </test-case>
-
-   <test-case name="error-code-302">
-      <description>Generate error XTDE0930</description>
-      <created by="Michael Kay" on="2012-11-07"/>
-      <environment ref="error001"/>
-      <dependencies>
-         <spec value="XSLT20+"/>
-      </dependencies>
-      <test>
-         <stylesheet file="error-code-302.xsl"/>
-         <initial-template name="main"/>
-      </test>
-      <result>
-         <error code="XTDE0930"/>
-      </result>
-   </test-case>
-
-   <test-case name="error-code-303">
-      <description>Generate error XTSE0940</description>
-      <created by="Michael Kay" on="2012-11-07"/>
-      <environment ref="error001"/>
-      <dependencies>
-         <spec value="XSLT20+"/>
-      </dependencies>
-      <test>
-         <stylesheet file="error-code-303.xsl"/>
-         <initial-template name="main"/>
-      </test>
-      <result>
-         <error code="XTSE0940"/>
-      </result>
-   </test-case>
-
-   <test-case name="error-code-304">
-      <description>Generate error XTTE0950</description>
-      <created by="Michael Kay" on="2012-11-07"/>
-      <environment ref="error001"/>
-      <dependencies>
-         <spec value="XSLT20+"/>
-         <feature value="schema_aware"/>
-      </dependencies>
-      <test>
-         <stylesheet file="error-code-304.xsl"/>
-         <initial-template name="main"/>
-      </test>
-      <result>
-         <error code="XTTE0950"/>
-      </result>
-   </test-case>
-
-   <test-case name="error-code-305">
-      <description>Generate error XTTE0950</description>
-      <created by="Michael Kay" on="2012-11-07"/>
-      <environment ref="error001"/>
-      <dependencies>
-         <spec value="XSLT20+"/>
-         <feature value="schema_aware"/>
-      </dependencies>
-      <test>
-         <stylesheet file="error-code-305.xsl"/>
-         <initial-template name="main"/>
-      </test>
-      <result>
-         <error code="XTTE0950"/>
-      </result>
-   </test-case>
-
-   <test-case name="error-code-306">
-      <description>Generate error XTSE0975</description>
-      <created by="Michael Kay" on="2012-11-07"/>
-      <environment ref="error001"/>
-      <dependencies>
-         <spec value="XSLT20+"/>
-      </dependencies>
-      <test>
-         <stylesheet file="error-code-306.xsl"/>
-         <initial-template name="main"/>
-      </test>
-      <result>
-         <error code="XTSE0975"/>
-      </result>
-   </test-case>
-
-   <test-case name="error-code-307">
-      <description>Generate error XTSE0975</description>
-      <created by="Michael Kay" on="2012-11-07"/>
-      <environment ref="error001"/>
-      <dependencies>
-         <spec value="XSLT20+"/>
-      </dependencies>
-      <test>
-         <stylesheet file="error-code-307.xsl"/>
-         <initial-template name="main"/>
-      </test>
-      <result>
-         <error code="XTSE0975"/>
-      </result>
-   </test-case>
-
-   <test-case name="error-code-308">
-      <description>Generate error XTSE0975</description>
-      <created by="Michael Kay" on="2012-11-07"/>
-      <environment ref="error001"/>
-      <dependencies>
-         <spec value="XSLT20+"/>
-      </dependencies>
-      <test>
-         <stylesheet file="error-code-308.xsl"/>
-         <initial-template name="main"/>
-      </test>
-      <result>
-         <error code="XTSE0975"/>
-      </result>
-   </test-case>
-
-   <test-case name="error-code-309">
-      <description>Generate error XTSE0975</description>
-      <created by="Michael Kay" on="2012-11-07"/>
-      <environment ref="error001"/>
-      <dependencies>
-         <spec value="XSLT20+"/>
-      </dependencies>
-      <test>
-         <stylesheet file="error-code-309.xsl"/>
-         <initial-template name="main"/>
-      </test>
-      <result>
-         <error code="XTSE0975"/>
-      </result>
-   </test-case>
-
-   <test-case name="error-code-310">
-      <description>Generate error XTDE0980</description>
-      <created by="Michael Kay" on="2012-11-07"/>
-      <environment ref="error001"/>
-      <dependencies>
-         <spec value="XSLT20+"/>
-      </dependencies>
-      <test>
-         <stylesheet file="error-code-310.xsl"/>
-         <initial-template name="main"/>
-      </test>
-      <result>
-         <error code="XTDE0980"/>
-      </result>
-   </test-case>
-
-   <test-case name="error-code-311">
-      <description>Generate error XTTE0990</description>
-      <created by="Michael Kay" on="2012-11-07"/>
-      <environment ref="error001"/>
-      <dependencies>
-         <spec value="XSLT20+"/>
-      </dependencies>
-      <test>
-         <stylesheet file="error-code-311.xsl"/>
-         <initial-template name="main"/>
-      </test>
-      <result>
-         <error code="XTTE0990"/>
-      </result>
-   </test-case>
-
-   <test-case name="error-code-312">
-      <description>Generate error XTTE1000</description>
-      <created by="Michael Kay" on="2012-11-07"/>
-      <environment ref="error001"/>
-      <dependencies>
-         <spec value="XSLT20+"/>
-      </dependencies>
-      <test>
-         <stylesheet file="error-code-312.xsl"/>
-         <initial-template name="main"/>
-      </test>
-      <result>
-         <error code="XTTE1000"/>
-      </result>
-   </test-case>
-
-   <test-case name="error-code-313">
-      <description>Generate error XTSE1015</description>
-      <created by="Michael Kay" on="2012-11-07"/>
-      <environment ref="error001"/>
-      <dependencies>
-         <spec value="XSLT20+"/>
-      </dependencies>
-      <test>
-         <stylesheet file="error-code-313.xsl"/>
-         <initial-template name="main"/>
-      </test>
-      <result>
-         <error code="XTSE1015"/>
-      </result>
-   </test-case>
-
-   <test-case name="error-code-314">
-      <description>Generate error XTSE1017</description>
-      <created by="Michael Kay" on="2012-11-07"/>
-      <environment ref="error001"/>
-      <dependencies>
-         <spec value="XSLT20+"/>
-      </dependencies>
-      <test>
-         <stylesheet file="error-code-314.xsl"/>
-         <initial-template name="main"/>
-      </test>
-      <result>
-         <error code="XTSE1017"/>
-      </result>
-   </test-case>
-
-   <test-case name="error-code-315">
-      <description>Generate error XTTE1020</description>
-      <created by="Michael Kay" on="2012-11-07"/>
-      <environment ref="error001"/>
-      <dependencies>
-         <spec value="XSLT20+"/>
-      </dependencies>
-      <test>
-         <stylesheet file="error-code-315.xsl"/>
-         <initial-template name="main"/>
-      </test>
-      <result>
-         <error code="XTTE1020"/>
-      </result>
-   </test-case>
-
-   <test-case name="error-code-316">
-      <description>Generate error XTDE1030</description>
-      <created by="Michael Kay" on="2012-11-07"/>
-      <environment ref="error001"/>
-      <dependencies>
-         <spec value="XSLT20+"/>
-      </dependencies>
-      <test>
-         <stylesheet file="error-code-316.xsl"/>
-         <initial-template name="main"/>
-      </test>
-      <result>
-         <error code="XTDE1030"/>
-      </result>
-   </test-case>
-
-   <test-case name="error-code-317">
-      <description>Generate error XTDE1035</description>
-      <created by="Michael Kay" on="2012-11-07"/>
-      <environment ref="error001"/>
-      <dependencies>
-         <spec value="XSLT20+"/>
-      </dependencies>
-      <test>
-         <stylesheet file="error-code-317.xsl"/>
-         <initial-template name="main"/>
-      </test>
-      <result>
-         <error code="XTDE1035"/>
-      </result>
-   </test-case>
-
-   <test-case name="error-code-318">
-      <description>Generate error XTSE1040</description>
-      <created by="Michael Kay" on="2012-11-07"/>
-      <environment ref="error001"/>
-      <dependencies>
-         <spec value="XSLT20+"/>
-      </dependencies>
-      <test>
-         <stylesheet file="error-code-318.xsl"/>
-         <initial-template name="main"/>
-      </test>
-      <result>
-         <error code="XTSE1040"/>
-      </result>
-   </test-case>
-
-   <test-case name="error-code-319">
-      <description>Generate error XTSE1060</description>
-      <created by="Michael Kay" on="2012-11-07"/>
-      <environment ref="error001"/>
-      <dependencies>
-         <spec value="XSLT20+"/>
-      </dependencies>
-      <test>
-         <stylesheet file="error-code-319.xsl"/>
-         <initial-template name="main"/>
-      </test>
-      <result>
-         <error code="XTSE1060"/>
-      </result>
-   </test-case>
-
-   <test-case name="error-code-320">
-      <description>Generate error XTSE1070</description>
-      <created by="Michael Kay" on="2012-11-07"/>
-      <environment ref="error001"/>
-      <dependencies>
-         <spec value="XSLT20+"/>
-      </dependencies>
-      <test>
-         <stylesheet file="error-code-320.xsl"/>
-         <initial-template name="main"/>
-      </test>
-      <result>
-         <error code="XTSE1070"/>
-      </result>
-   </test-case>
-
-   <test-case name="error-code-321">
-      <description>Generate error XTSE1080</description>
-      <created by="Michael Kay" on="2012-11-07"/>
-      <environment ref="error001"/>
-      <dependencies>
-         <spec value="XSLT20+"/>
-      </dependencies>
-      <test>
-         <stylesheet file="error-code-321.xsl"/>
-         <initial-template name="main"/>
-      </test>
-      <result>
-         <error code="XTSE1080"/>
-      </result>
-   </test-case>
-
-   <test-case name="error-code-322">
-      <description>Generate error XTSE1080</description>
-      <created by="Michael Kay" on="2012-11-07"/>
-      <environment ref="error001"/>
-      <dependencies>
-         <spec value="XSLT20+"/>
-      </dependencies>
-      <test>
-         <stylesheet file="error-code-322.xsl"/>
-         <initial-template name="main"/>
-      </test>
-      <result>
-         <error code="XTSE1080"/>
-      </result>
-   </test-case>
-
-   <test-case name="error-code-323">
-      <description>Generate error XTSE1080</description>
-      <created by="Michael Kay" on="2012-11-07"/>
-      <environment ref="error001"/>
-      <dependencies>
-         <spec value="XSLT20+"/>
-      </dependencies>
-      <test>
-         <stylesheet file="error-code-323.xsl"/>
-         <initial-template name="main"/>
-      </test>
-      <result>
-         <error code="XTSE1080"/>
-      </result>
-   </test-case>
-
-   <test-case name="error-code-324">
-      <description>Generate error XTSE1090</description>
-      <created by="Michael Kay" on="2012-11-07"/>
-      <environment ref="error001"/>
-      <dependencies>
-         <spec value="XSLT20+"/>
-      </dependencies>
-      <test>
-         <stylesheet file="error-code-324.xsl"/>
-         <initial-template name="main"/>
-      </test>
-      <result>
-         <error code="XTSE1090"/>
-      </result>
-   </test-case>
-
-   <test-case name="error-code-325">
-      <description>Generate error XTTE1100</description>
-      <created by="Michael Kay" on="2012-11-07"/>
-      <environment ref="error001"/>
-      <dependencies>
-         <spec value="XSLT20+"/>
-      </dependencies>
-      <test>
-         <stylesheet file="error-code-325.xsl"/>
-         <initial-template name="main"/>
-      </test>
-      <result>
-         <error code="XTTE1100"/>
-      </result>
-   </test-case>
-
-   <test-case name="error-code-326">
-      <description>Generate error XTTE1100</description>
-      <created by="Michael Kay" on="2012-11-07"/>
-      <environment ref="error001"/>
-      <dependencies>
-         <spec value="XSLT20+"/>
-      </dependencies>
-      <test>
-         <stylesheet file="error-code-326.xsl"/>
-         <initial-template name="main"/>
-      </test>
-      <result>
-         <error code="XTTE1100"/>
-      </result>
-   </test-case>
-
-   <test-case name="error-code-327">
-      <description>Generate error XTDE1110</description>
-      <created by="Michael Kay" on="2012-11-07"/>
-      <environment ref="error001"/>
-      <dependencies>
-         <spec value="XSLT20+"/>
-      </dependencies>
-      <test>
-         <stylesheet file="error-code-327.xsl"/>
-         <initial-template name="main"/>
-      </test>
-      <result>
-         <error code="XTDE1110"/>
-      </result>
-   </test-case>
-
-   <test-case name="error-code-328">
-      <description>Generate error XTTE1120</description>
-      <created by="Michael Kay" on="2012-11-07"/>
-      <modified by="Abel Braaksma" on="2013-12-09" change="Error code XTTE1120 absent in xslt3.0 spec. Changed dependency to xslt20"/>
-      <environment ref="error001"/>
-      <dependencies>
-         <spec value="XSLT20"/>
-      </dependencies>
-      <test>
-         <stylesheet file="error-code-328.xsl"/>
-         <initial-template name="main"/>
-      </test>
-      <result>
-         <error code="XTTE1120"/>
-      </result>
-   </test-case>
-
-   <test-case name="error-code-329">
-      <description>Generate error XTSE1130</description>
-      <created by="Michael Kay" on="2012-11-07"/>
-      <environment ref="error001"/>
-      <dependencies>
-         <spec value="XSLT20+"/>
-      </dependencies>
-      <test>
-         <stylesheet file="error-code-329.xsl"/>
-         <initial-template name="main"/>
-      </test>
-      <result>
-         <error code="XTSE1130"/>
-      </result>
-   </test-case>
-
-   <test-case name="error-code-330">
-      <description>Generate error XTDE1140</description>
-      <created by="Michael Kay" on="2012-11-07"/>
-      <environment ref="error001"/>
-      <dependencies>
-         <spec value="XSLT20+"/>
-      </dependencies>
-      <test>
-         <stylesheet file="error-code-330.xsl"/>
-         <initial-template name="main"/>
-      </test>
-      <result>
-         <error code="XTDE1140"/>
-      </result>
-   </test-case>
-
-   <test-case name="error-code-331">
-      <description>Generate error XTDE1145</description>
-      <created by="Michael Kay" on="2012-11-07"/>
-      <environment ref="error001"/>
-      <dependencies>
-         <spec value="XSLT20+"/>
-      </dependencies>
-      <test>
-         <stylesheet file="error-code-331.xsl"/>
-         <initial-template name="main"/>
-      </test>
-      <result>
-         <error code="XTDE1145"/>
-      </result>
-   </test-case>
-
-   <test-case name="error-code-332">
-      <description>Generate error XTDE1150. Regex in analyze-string matches zero-length string;
-        no longer an error in XSLT 3.0</description>
-      <created by="Michael Kay" on="2012-11-07"/>
-      <modified by="Michael Kay" on="2014-04-01" change="changed dependency to XSLT 2.0 only"/>
-      <environment ref="error001"/>
-      <dependencies>
-         <spec value="XSLT20"/>
-      </dependencies>
-      <test>
-         <stylesheet file="error-code-332.xsl"/>
-         <initial-template name="main"/>
-      </test>
-      <result>
-         <error code="XTDE1150"/>
-      </result>
-   </test-case>
-
-   <test-case name="error-code-333">
-      <description>Generate error XTRE1160/XTDE1160</description>
-      <created by="Michael Kay" on="2012-11-07"/>
-      <modified by="Michael Kay" on="2014-04-01" change="error code changes in XSLT 3.0"/>
-      <environment ref="error001"/>
-      <dependencies>
-         <spec value="XSLT20+"/>
-      </dependencies>
-      <test>
-         <stylesheet file="error-code-333.xsl"/>
-         <initial-template name="main"/>
-      </test>
-      <result>
-         <any-of>
-           <error code="XTRE1160"/> <!-- XSLT 2.0 -->
-           <error code="XTDE1160"/> <!-- XSLT 3.0 -->
-         </any-of>  
-      </result>
-   </test-case>
-
-   <test-case name="error-code-334">
-      <description>Generate error XTDE1170</description>
-      <created by="Michael Kay" on="2012-11-07"/>
-      <environment ref="error001"/>
-      <dependencies>
-         <spec value="XSLT20+"/>
-      </dependencies>
-      <test>
-         <stylesheet file="error-code-334.xsl"/>
-         <initial-template name="main"/>
-      </test>
-      <result>
-         <any-of>
-            <error code="XTDE1170"/>
-            <error code="XTDE1200"/>
-         </any-of>
-      </result>
-   </test-case>
-
-   <test-case name="error-code-335">
-      <description>Generate error XTDE1190</description>
-      <created by="Michael Kay" on="2012-11-07"/>
-      <environment ref="error001"/>
-      <dependencies>
-         <spec value="XSLT20+"/>
-      </dependencies>
-      <test>
-         <stylesheet file="error-code-335.xsl"/>
-         <initial-template name="main"/>
-      </test>
-      <result>
-         <any-of>
-            <error code="XTDE1190"/>
-            <error code="XTDE1200"/>
-         </any-of>
-      </result>
-   </test-case>
-
-   <test-case name="error-code-336">
-      <description>Generate error XTDE1200</description>
-      <created by="Michael Kay" on="2012-11-07"/>
-      <environment ref="error001"/>
-      <dependencies>
-         <spec value="XSLT20+"/>
-      </dependencies>
-      <test>
-         <stylesheet file="error-code-336.xsl"/>
-         <initial-template name="main"/>
-      </test>
-      <result>
-         <error code="XTDE1200"/>
-      </result>
-   </test-case>
-
-   <test-case name="error-code-337">
-      <description>Generate error XTSE1205</description>
-      <created by="Michael Kay" on="2012-11-07"/>
-      <environment ref="error001"/>
-      <dependencies>
-         <spec value="XSLT20+"/>
-      </dependencies>
-      <test>
-         <stylesheet file="error-code-337.xsl"/>
-         <initial-template name="main"/>
-      </test>
-      <result>
-         <error code="XTSE1205"/>
-      </result>
-   </test-case>
-
-   <test-case name="error-code-338">
-      <description>Generate error XTSE1205</description>
-      <created by="Michael Kay" on="2012-11-07"/>
-      <environment ref="error001"/>
-      <dependencies>
-         <spec value="XSLT20+"/>
-      </dependencies>
-      <test>
-         <stylesheet file="error-code-338.xsl"/>
-         <initial-template name="main"/>
-      </test>
-      <result>
-         <error code="XTSE1205"/>
-      </result>
-   </test-case>
-
-   <test-case name="error-code-339">
-      <description>Generate error XTSE1210</description>
-      <created by="Michael Kay" on="2012-11-07"/>
-      <environment ref="error001"/>
-      <dependencies>
-         <spec value="XSLT20+"/>
-      </dependencies>
-      <test>
-         <stylesheet file="error-code-339.xsl"/>
-         <initial-template name="main"/>
-      </test>
-      <result>
-         <error code="XTSE1210"/>
-      </result>
-   </test-case>
-
-   <test-case name="error-code-340">
-      <description>Generate error XTSE1220 (different collations for two keys). May also generate XTSE1210 (unknown collation)</description>
-      <created by="Michael Kay" on="2012-11-07"/>
-      <environment ref="error001"/>
-      <dependencies>
-         <spec value="XSLT20+"/>
-      </dependencies>
-      <test>
-         <stylesheet file="error-code-340.xsl"/>
-         <initial-template name="main"/>
-      </test>
-      <result>
-         <any-of>
-            <error code="XTSE1210"/>
-            <error code="XTSE1220"/>
-         </any-of>
-      </result>
-   </test-case>
-
-   <test-case name="error-code-341">
-      <description>Generate error XTDE1260</description>
-      <created by="Michael Kay" on="2012-11-07"/>
-      <environment ref="error001"/>
-      <dependencies>
-         <spec value="XSLT20+"/>
-      </dependencies>
-      <test>
-         <stylesheet file="error-code-341.xsl"/>
-         <initial-template name="main"/>
-      </test>
-      <result>
-         <error code="XTDE1260"/>
-      </result>
-   </test-case>
-
-   <test-case name="error-code-342">
-      <description>Generate error XTDE1260</description>
-      <created by="Michael Kay" on="2012-11-07"/>
-      <environment ref="error001"/>
-      <dependencies>
-         <spec value="XSLT20+"/>
-      </dependencies>
-      <test>
-         <stylesheet file="error-code-342.xsl"/>
-         <initial-template name="main"/>
-      </test>
-      <result>
-         <error code="XTDE1260"/>
-      </result>
-   </test-case>
-
-   <test-case name="error-code-343">
-      <description>Generate error XTDE1270</description>
-      <created by="Michael Kay" on="2012-11-07"/>
-      <environment ref="error001"/>
-      <dependencies>
-         <spec value="XSLT20+"/>
-      </dependencies>
-      <test>
-         <stylesheet file="error-code-343.xsl"/>
-      </test>
-      <result>
-         <error code="XTDE1270"/>
-      </result>
-   </test-case>
-
-   <test-case name="error-code-344">
-      <description>Generate error XTDE1270</description>
-      <created by="Michael Kay" on="2012-11-07"/>
-      <environment ref="error001"/>
-      <dependencies>
-         <spec value="XSLT20+"/>
-      </dependencies>
-      <test>
-         <stylesheet file="error-code-344.xsl"/>
-         <initial-template name="main"/>
-      </test>
-      <result>
-         <error code="XTDE1270"/>
-      </result>
-   </test-case>
-
-   <test-case name="error-code-345">
-      <description>Generate error XTDE1270</description>
-      <created by="Michael Kay" on="2012-11-07"/>
-      <environment ref="error001"/>
-      <dependencies>
-         <spec value="XSLT20+"/>
-      </dependencies>
-      <test>
-         <stylesheet file="error-code-345.xsl"/>
-         <initial-template name="main"/>
-      </test>
-      <result>
-         <error code="XTDE1270"/>
-      </result>
-   </test-case>
-
-   <test-case name="error-code-346">
-      <description>Generate error XTDE1280</description>
-      <created by="Michael Kay" on="2012-11-07"/>
-      <modified by="Abel Braaksma" on="2013-12-09" change="Error code XTDE1280 is specific to XSLT20 (FODF1280 for XSLT30). Changed dependency to XSLT20"/>
-      <environment ref="error001"/>
-      <dependencies>
-         <spec value="XSLT20"/>
-      </dependencies>
-      <test>
-         <stylesheet file="error-code-346.xsl"/>
-         <initial-template name="main"/>
-      </test>
-      <result>
-         <error code="XTDE1280"/>
-      </result>
-   </test-case>
-
-   <test-case name="error-code-346b">
-      <description>Generate error FODF1280 (3.0)</description>
-      <created by="Abel Braaksma" on="2013-12-09"/>
-      <environment ref="error001"/>
-      <dependencies>
-         <spec value="XSLT30+"/>
-      </dependencies>
-      <test>
-         <stylesheet file="error-code-346.xsl"/>
-         <initial-template name="main"/>
-      </test>
-      <result>
-         <error code="FODF1280"/>
-      </result>
-   </test-case>
-
-   <test-case name="error-code-347">
-      <description>Generate error XTSE1290</description>
-      <created by="Michael Kay" on="2012-11-07"/>
-      <environment ref="error001"/>
-      <dependencies>
-         <spec value="XSLT20+"/>
-      </dependencies>
-      <test>
-         <stylesheet file="error-code-347.xsl"/>
-         <initial-template name="main"/>
-      </test>
-      <result>
-         <error code="XTSE1290"/>
-      </result>
-   </test-case>
-
-   <test-case name="error-code-348">
-      <description>Generate error XTSE1295</description>
-      <created by="Michael Kay" on="2012-11-07"/>
-      <environment ref="error001"/>
-      <dependencies>
-         <spec value="XSLT20+"/>
-      </dependencies>
-      <test>
-         <stylesheet file="error-code-348.xsl"/>
-         <initial-template name="main"/>
-      </test>
-      <result>
-         <error code="XTSE1295"/>
-      </result>
-   </test-case>
-
-   <test-case name="error-code-349">
-      <description>Generate error XTSE1295</description>
-      <created by="Michael Kay" on="2012-11-07"/>
-      <environment ref="error001"/>
-      <dependencies>
-         <spec value="XSLT20+"/>
-      </dependencies>
-      <test>
-         <stylesheet file="error-code-349.xsl"/>
-         <initial-template name="main"/>
-      </test>
-      <result>
-         <error code="XTSE1295"/>
-      </result>
-   </test-case>
-
-   <test-case name="error-code-350">
-      <description>Generate error XTSE1300</description>
-      <created by="Michael Kay" on="2012-11-07"/>
-      <environment ref="error001"/>
-      <dependencies>
-         <spec value="XSLT20+"/>
-      </dependencies>
-      <test>
-         <stylesheet file="error-code-350.xsl"/>
-         <initial-template name="main"/>
-      </test>
-      <result>
-         <error code="XTSE1300"/>
-      </result>
-   </test-case>
-
-   <test-case name="error-code-351">
-      <description>Generate error XTSE1300</description>
-      <created by="Michael Kay" on="2012-11-07"/>
-      <environment ref="error001"/>
-      <dependencies>
-         <spec value="XSLT20+"/>
-      </dependencies>
-      <test>
-         <stylesheet file="error-code-351.xsl"/>
-         <initial-template name="main"/>
-      </test>
-      <result>
-         <error code="XTSE1300"/>
-      </result>
-   </test-case>
-
-   <test-case name="error-code-352">
-      <description>Generate error XTSE1300</description>
-      <created by="Michael Kay" on="2012-11-07"/>
-      <environment ref="error001"/>
-      <dependencies>
-         <spec value="XSLT20+"/>
-      </dependencies>
-      <test>
-         <stylesheet file="error-code-352.xsl"/>
-         <initial-template name="main"/>
-      </test>
-      <result>
-         <error code="XTSE1300"/>
-      </result>
-   </test-case>
-
-   <test-case name="error-code-353a">
-      <description>Generate error XTDE1310</description>
-      <created by="Michael Kay" on="2012-11-07"/>
-      <environment ref="error001"/>
-      <dependencies>
-         <spec value="XSLT20"/>
-      </dependencies>
-      <test>
-         <stylesheet file="error-code-353.xsl"/>
-         <initial-template name="main"/>
-      </test>
-      <result>
-         <error code="XTDE1310"/>
-      </result>
-   </test-case>
-   
-   <test-case name="error-code-353b">
-      <description>Generate error FODF1310 (3.0)</description>
-      <created by="Michael Kay" on="2012-11-07"/>
-      <environment ref="error001"/>
-      <dependencies>
-         <spec value="XSLT30+"/>
-      </dependencies>
-      <test>
-         <stylesheet file="error-code-353.xsl"/>
-         <initial-template name="main"/>
-      </test>
-      <result>
-         <error code="FODF1310"/>
-      </result>
-   </test-case>
-
-   <test-case name="error-code-354a">
-      <description>Generate error XTDE1310</description>
-      <created by="Michael Kay" on="2012-11-07"/>
-      <environment ref="error001"/>
-      <dependencies>
-         <spec value="XSLT20"/>
-      </dependencies>
-      <test>
-         <stylesheet file="error-code-354.xsl"/>
-         <initial-template name="main"/>
-      </test>
-      <result>
-         <error code="XTDE1310"/>
-      </result>
-   </test-case>
-   
-   <test-case name="error-code-354b">
-      <description>Generate error FODF1310 (3.0)</description>
-      <created by="Michael Kay" on="2012-11-07"/>
-      <environment ref="error001"/>
-      <dependencies>
-         <spec value="XSLT30+"/>
-      </dependencies>
-      <test>
-         <stylesheet file="error-code-354.xsl"/>
-         <initial-template name="main"/>
-      </test>
-      <result>
-         <error code="FODF1310"/>
-      </result>
-   </test-case>
-
-   <test-case name="error-code-355a">
-      <description>Generate error XTDE1310</description>
-      <created by="Michael Kay" on="2012-11-07"/>
-      <environment ref="error001"/>
-      <dependencies>
-         <spec value="XSLT20"/>
-      </dependencies>
-      <test>
-         <stylesheet file="error-code-355.xsl"/>
-         <initial-template name="main"/>
-      </test>
-      <result>
-         <error code="XTDE1310"/>
-      </result>
-   </test-case>
-   
-   <test-case name="error-code-355b">
-      <description>Generate error FODF1310 (3.0)</description>
-      <created by="Michael Kay" on="2012-11-07"/>
-      <environment ref="error001"/>
-      <dependencies>
-         <spec value="XSLT30+"/>
-      </dependencies>
-      <test>
-         <stylesheet file="error-code-355.xsl"/>
-         <initial-template name="main"/>
-      </test>
-      <result>
-         <error code="FODF1310"/>
-      </result>
-   </test-case>
-
-   <test-case name="error-code-356a">
-      <description>Generate error XTDE1310</description>
-      <created by="Michael Kay" on="2012-11-07"/>
-      <environment ref="error001"/>
-      <dependencies>
-         <spec value="XSLT20"/>
-      </dependencies>
-      <test>
-         <stylesheet file="error-code-356.xsl"/>
-         <initial-template name="main"/>
-      </test>
-      <result>
-         <error code="XTDE1310"/>
-      </result>
-   </test-case>
-   
-   <test-case name="error-code-356b">
-      <description>Generate error FODF1310 (3.0)</description>
-      <created by="Michael Kay" on="2012-11-07"/>
-      <modified by="Michael Kay" on="2012-12-14" change="Fixed spec dependency"/>
-      <environment ref="error001"/>
-      <dependencies>
-         <spec value="XSLT30+"/>
-      </dependencies>
-      <test>
-         <stylesheet file="error-code-356.xsl"/>
-         <initial-template name="main"/>
-      </test>
-      <result>
-         <error code="FODF1310"/>
-      </result>
-   </test-case>
-
-   <test-case name="error-code-357a">
-      <description>Generate error XTDE1310</description>
-      <created by="Michael Kay" on="2012-11-07"/>
-      <environment ref="error001"/>
-      <dependencies>
-         <spec value="XSLT20"/>
-      </dependencies>
-      <test>
-         <stylesheet file="error-code-357.xsl"/>
-         <initial-template name="main"/>
-      </test>
-      <result>
-         <error code="XTDE1310"/>
-      </result>
-   </test-case>
-   
-   <test-case name="error-code-357b">
-      <description>Generate error FODF1310 (3.0)</description>
-      <created by="Michael Kay" on="2012-11-07"/>
-      <environment ref="error001"/>
-      <dependencies>
-         <spec value="XSLT30+"/>
-      </dependencies>
-      <test>
-         <stylesheet file="error-code-357.xsl"/>
-         <initial-template name="main"/>
-      </test>
-      <result>
-         <error code="FODF1310"/>
-      </result>
-   </test-case>
-
-   <test-case name="error-code-358a">
-      <description>Generate error XTDE1310</description>
-      <created by="Michael Kay" on="2012-11-07"/>
-      <environment ref="error001"/>
-      <dependencies>
-         <spec value="XSLT20"/>
-      </dependencies>
-      <test>
-         <stylesheet file="error-code-358.xsl"/>
-         <initial-template name="main"/>
-      </test>
-      <result>
-         <error code="XTDE1310"/>
-      </result>
-   </test-case>
-   
-   <test-case name="error-code-358b">
-      <description>Generate error FODF1310 (3.0)</description>
-      <created by="Michael Kay" on="2012-11-07"/>
-      <environment ref="error001"/>
-      <dependencies>
-         <spec value="XSLT30+"/>
-      </dependencies>
-      <test>
-         <stylesheet file="error-code-358.xsl"/>
-         <initial-template name="main"/>
-      </test>
-      <result>
-         <error code="FODF1310"/>
-      </result>
-   </test-case>
-
-   <test-case name="error-code-359a">
-      <description>Generate error XTDE1310</description>
-      <created by="Michael Kay" on="2012-11-07"/>
-      <environment ref="error001"/>
-      <dependencies>
-         <spec value="XSLT20"/>
-      </dependencies>
-      <test>
-         <stylesheet file="error-code-359.xsl"/>
-         <initial-template name="main"/>
-      </test>
-      <result>
-         <error code="XTDE1310"/>
-      </result>
-   </test-case>
-   
-   <test-case name="error-code-359b">
-      <description>Generate error FODF1310 (3.0)</description>
-      <created by="Michael Kay" on="2012-11-07"/>
-      <environment ref="error001"/>
-      <dependencies>
-         <spec value="XSLT30+"/>
-      </dependencies>
-      <test>
-         <stylesheet file="error-code-359.xsl"/>
-         <initial-template name="main"/>
-      </test>
-      <result>
-         <error code="FODF1310"/>
-      </result>
-   </test-case>
-
-   <test-case name="error-code-360a">
-      <description>Generate error XTDE1310</description>
-      <created by="Michael Kay" on="2012-11-07"/>
-      <environment ref="error001"/>
-      <dependencies>
-         <spec value="XSLT20"/>
-      </dependencies>
-      <test>
-         <stylesheet file="error-code-360.xsl"/>
-         <initial-template name="main"/>
-      </test>
-      <result>
-         <error code="XTDE1310"/>
-      </result>
-   </test-case>
-   
-   <test-case name="error-code-360b">
-      <description>Generate error FODF 1310 (3.0)</description>
-      <created by="Michael Kay" on="2012-11-07"/>
-      <environment ref="error001"/>
-      <dependencies>
-         <spec value="XSLT30+"/>
-      </dependencies>
-      <test>
-         <stylesheet file="error-code-360.xsl"/>
-         <initial-template name="main"/>
-      </test>
-      <result>
-         <error code="FODF1310"/>
-      </result>
-   </test-case>
-
-   <test-case name="error-code-361a">
-      <description>Generate error XTDE1310</description>
-      <created by="Michael Kay" on="2012-11-07"/>
-      <environment ref="error001"/>
-      <dependencies>
-         <spec value="XSLT20"/>
-      </dependencies>
-      <test>
-         <stylesheet file="error-code-361.xsl"/>
-         <initial-template name="main"/>
-      </test>
-      <result>
-         <error code="XTDE1310"/>
-      </result>
-   </test-case>
-   
-   <test-case name="error-code-361b">
-      <description>Generate error FODF1310 (3.0)</description>
-      <created by="Michael Kay" on="2012-11-07"/>
-      <environment ref="error001"/>
-      <dependencies>
-         <spec value="XSLT30+"/>
-      </dependencies>
-      <test>
-         <stylesheet file="error-code-361.xsl"/>
-         <initial-template name="main"/>
-      </test>
-      <result>
-         <error code="FODF1310"/>
-      </result>
-   </test-case>
-
-   <test-case name="error-code-362">
-      <description>Generate error XTDE1340</description>
-      <created by="Michael Kay" on="2012-11-07"/>
-      <environment ref="error001"/>
-      <dependencies>
-         <spec value="XSLT20+"/>
-      </dependencies>
-      <test>
-         <stylesheet file="error-code-362.xsl"/>
-         <initial-template name="main"/>
-      </test>
-      <result>
-         <error code="XTDE1340"/>
-      </result>
-   </test-case>
-
-   <test-case name="error-code-363">
-      <description>Generate error XTDE1350</description>
-      <created by="Michael Kay" on="2012-11-07"/>
-      <environment ref="error001"/>
-      <dependencies>
-         <spec value="XSLT20+"/>
-      </dependencies>
-      <test>
-         <stylesheet file="error-code-363.xsl"/>
-         <initial-template name="main"/>
-      </test>
-      <result>
-         <error code="XTDE1350"/>
-      </result>
-   </test-case>
-
-   <test-case name="error-code-364">
-      <description>Generate error XTDE1360</description>
-      <created by="Michael Kay" on="2012-11-07"/>
-      <environment ref="error001"/>
-      <dependencies>
-         <spec value="XSLT20+"/>
-      </dependencies>
-      <test>
-         <stylesheet file="error-code-364.xsl"/>
-         <initial-template name="main"/>
-      </test>
-      <result>
-         <error code="XTDE1360"/>
-      </result>
-   </test-case>
-
-   <test-case name="error-code-365">
-      <description>Generate error XTDE1370</description>
-      <created by="Michael Kay" on="2012-11-07"/>
-      <environment ref="error001"/>
-      <dependencies>
-         <spec value="XSLT20+"/>
-      </dependencies>
-      <test>
-         <stylesheet file="error-code-365.xsl"/>
-         <initial-template name="main"/>
-      </test>
-      <result>
-         <error code="XTDE1370"/>
-      </result>
-   </test-case>
-
-   <test-case name="error-code-366">
-      <description>Generate error XTDE1370</description>
-      <created by="Michael Kay" on="2012-11-07"/>
-      <environment ref="error001"/>
-      <dependencies>
-         <spec value="XSLT20+"/>
-      </dependencies>
-      <test>
-         <stylesheet file="error-code-366.xsl"/>
-         <initial-template name="main"/>
-      </test>
-      <result>
-         <error code="XTDE1370"/>
-      </result>
-   </test-case>
-
-   <test-case name="error-code-367">
-      <description>Generate error XTDE1380</description>
-      <created by="Michael Kay" on="2012-11-07"/>
-      <environment ref="error001"/>
-      <dependencies>
-         <spec value="XSLT20+"/>
-      </dependencies>
-      <test>
-         <stylesheet file="error-code-367.xsl"/>
-         <initial-template name="main"/>
-      </test>
-      <result>
-         <error code="XTDE1380"/>
-      </result>
-   </test-case>
-
-   <test-case name="error-code-368">
-      <description>Generate error XTDE1380</description>
-      <created by="Michael Kay" on="2012-11-07"/>
-      <environment ref="error001"/>
-      <dependencies>
-         <spec value="XSLT20+"/>
-      </dependencies>
-      <test>
-         <stylesheet file="error-code-368.xsl"/>
-         <initial-template name="main"/>
-      </test>
-      <result>
-         <error code="XTDE1380"/>
-      </result>
-   </test-case>
-
-   <test-case name="error-code-369">
-      <description>Generate error XTDE1390</description>
-      <created by="Michael Kay" on="2012-11-07"/>
-      <environment ref="error001"/>
-      <dependencies>
-         <spec value="XSLT20+"/>
-      </dependencies>
-      <test>
-         <stylesheet file="error-code-369.xsl"/>
-         <initial-template name="main"/>
-      </test>
-      <result>
-         <error code="XTDE1390"/>
-      </result>
-   </test-case>
-
-   <test-case name="error-code-370">
-      <description>Generate error XTDE1390</description>
-      <created by="Michael Kay" on="2012-11-07"/>
-      <environment ref="error001"/>
-      <dependencies>
-         <spec value="XSLT20+"/>
-      </dependencies>
-      <test>
-         <stylesheet file="error-code-370.xsl"/>
-         <initial-template name="main"/>
-      </test>
-      <result>
-         <error code="XTDE1390"/>
-      </result>
-   </test-case>
-
-   <test-case name="error-code-371">
-      <description>Generate error XTDE1390</description>
-      <created by="Michael Kay" on="2012-11-07"/>
-      <environment ref="error001"/>
-      <dependencies>
-         <spec value="XSLT20+"/>
-      </dependencies>
-      <test>
-         <stylesheet file="error-code-371.xsl"/>
-         <initial-template name="main"/>
-      </test>
-      <result>
-         <error code="XTDE1390"/>
-      </result>
-   </test-case>
-
-   <test-case name="error-code-372">
-      <description>Generate error XTDE1400</description>
-      <created by="Michael Kay" on="2012-11-07"/>
-      <environment ref="error001"/>
-      <dependencies>
-         <spec value="XSLT20+"/>
-      </dependencies>
-      <test>
-         <stylesheet file="error-code-372.xsl"/>
-         <initial-template name="main"/>
-      </test>
-      <result>
-         <error code="XTDE1400"/>
-      </result>
-   </test-case>
-
-   <test-case name="error-code-373">
-      <description>Generate error XTDE1400</description>
-      <created by="Michael Kay" on="2012-11-07"/>
-      <environment ref="error001"/>
-      <dependencies>
-         <spec value="XSLT20+"/>
-      </dependencies>
-      <test>
-         <stylesheet file="error-code-373.xsl"/>
-         <initial-template name="main"/>
-      </test>
-      <result>
-         <error code="XTDE1400"/>
-      </result>
-   </test-case>
-
-   <test-case name="error-code-374">
-      <description>Generate error XTSE1430</description>
-      <created by="Michael Kay" on="2012-11-07"/>
-      <environment ref="error001"/>
-      <dependencies>
-         <spec value="XSLT20+"/>
-      </dependencies>
-      <test>
-         <stylesheet file="error-code-374.xsl"/>
-         <initial-template name="main"/>
-      </test>
-      <result>
-         <error code="XTSE1430"/>
-      </result>
-   </test-case>
-
-   <test-case name="error-code-375">
-      <description>Generate error XTDE1440</description>
-      <created by="Michael Kay" on="2012-11-07"/>
-      <environment ref="error001"/>
-      <dependencies>
-         <spec value="XSLT20+"/>
-      </dependencies>
-      <test>
-         <stylesheet file="error-code-375.xsl"/>
-         <initial-template name="main"/>
-      </test>
-      <result>
-         <error code="XTDE1440"/>
-      </result>
-   </test-case>
-
-   <test-case name="error-code-376">
-      <description>Generate error XTDE1440</description>
-      <created by="Michael Kay" on="2012-11-07"/>
-      <environment ref="error001"/>
-      <dependencies>
-         <spec value="XSLT20+"/>
-      </dependencies>
-      <test>
-         <stylesheet file="error-code-376.xsl"/>
-         <initial-template name="main"/>
-      </test>
-      <result>
-         <error code="XTDE1440"/>
-      </result>
-   </test-case>
-
-   <test-case name="error-code-377">
-      <description>Generate error XTSE0010 (Note: was XTDE1450 in an earlier draft specification)</description>
-      <created by="Michael Kay" on="2012-11-07"/>
-      <environment ref="error001"/>
-      <dependencies>
-         <spec value="XSLT20+"/>
-      </dependencies>
-      <test>
-         <stylesheet file="error-code-377.xsl"/>
-         <initial-template name="main"/>
-      </test>
-      <result>
-         <error code="XTSE0010"/>
-      </result>
-   </test-case>
-
-   <test-case name="error-code-378">
-      <description>Generate error XTDE1450</description>
-      <created by="Michael Kay" on="2012-11-07"/>
-      <environment ref="error001"/>
-      <dependencies>
-         <spec value="XSLT20+"/>
-      </dependencies>
-      <test>
-         <stylesheet file="error-code-378.xsl"/>
-         <initial-template name="main"/>
-      </test>
-      <result>
-         <error code="XTDE1450"/>
-      </result>
-   </test-case>
-
-   <test-case name="error-code-379">
-      <description>Generate error XTDE1460</description>
-      <created by="Michael Kay" on="2012-11-07"/>
-      <environment ref="error001"/>
-      <dependencies>
-         <spec value="XSLT20+"/>
-      </dependencies>
-      <test>
-         <stylesheet file="error-code-379.xsl"/>
-         <initial-template name="main"/>
-      </test>
-      <result>
-         <error code="XTDE1460"/>
-      </result>
-   </test-case>
-
-   <test-case name="error-code-380">
-      <description>Generate error XTDE1460</description>
-      <created by="Michael Kay" on="2012-11-07"/>
-      <environment ref="error001"/>
-      <dependencies>
-         <spec value="XSLT20+"/>
-      </dependencies>
-      <test>
-         <stylesheet file="error-code-380.xsl"/>
-         <initial-template name="main"/>
-      </test>
-      <result>
-         <error code="XTDE1460"/>
-      </result>
-   </test-case>
-
-   <test-case name="error-code-381">
-      <description>Generate error XTDE1460</description>
-      <created by="Michael Kay" on="2012-11-07"/>
-      <environment ref="error001"/>
-      <dependencies>
-         <spec value="XSLT20+"/>
-      </dependencies>
-      <test>
-         <stylesheet file="error-code-381.xsl"/>
-         <initial-template name="main"/>
-      </test>
-      <result>
-         <any-of>
-            <error code="XTDE0290"/>
-            <error code="XTDE1460"/>
-         </any-of>
-      </result>
-   </test-case>
-
-   <test-case name="error-code-382">
-      <description>Generate error XTDE1480</description>
-      <created by="Michael Kay" on="2012-11-07"/>
-      <environment ref="error001"/>
-      <dependencies>
-         <spec value="XSLT20+"/>
-      </dependencies>
-      <test>
-         <stylesheet file="error-code-382.xsl"/>
-         <initial-template name="main"/>
-      </test>
-      <result>
-         <error code="XTDE1480"/>
-      </result>
-   </test-case>
-
-   <test-case name="error-code-383">
-      <description>Generate error XTDE1480</description>
-      <created by="Michael Kay" on="2012-11-07"/>
-      <environment ref="error001"/>
-      <dependencies>
-         <spec value="XSLT20+"/>
-      </dependencies>
-      <test>
-         <stylesheet file="error-code-383.xsl"/>
-         <initial-template name="main"/>
-      </test>
-      <result>
-         <error code="XTDE1480"/>
-      </result>
-   </test-case>
-
-   <test-case name="error-code-384">
-      <description>Generate error XTDE1490</description>
-      <created by="Michael Kay" on="2012-11-07"/>
-      <environment ref="error001"/>
-      <dependencies>
-         <spec value="XSLT20+"/>
-      </dependencies>
-      <test>
-         <stylesheet file="error-code-384.xsl"/>
-         <initial-template name="main"/>
-      </test>
-      <result>
-         <error code="XTDE1490"/>
-      </result>
-   </test-case>
-
-   <test-case name="error-code-385">
-      <description>Generate error XTRE1500</description>
-      <created by="Michael Kay" on="2012-11-07"/>
-      <environment ref="error001"/>
-      <dependencies>
-         <spec value="XSLT20+"/>
-      </dependencies>
-      <test>
-         <stylesheet file="error-code-385.xsl"/>
-         <initial-template name="main"/>
-      </test>
-      <result>
-         <error code="XTRE1500"/>
-      </result>
-   </test-case>
-
-   <test-case name="error-code-386">
-      <description>Generate error XTSE1505</description>
-      <created by="Michael Kay" on="2012-11-07"/>
-      <environment ref="error001"/>
-      <dependencies>
-         <spec value="XSLT20+"/>
-         <feature value="schema_aware"/>
-      </dependencies>
-      <test>
-         <stylesheet file="error-code-386.xsl"/>
-         <initial-template name="main"/>
-      </test>
-      <result>
-         <error code="XTSE1505"/>
-      </result>
-   </test-case>
-
-   <test-case name="error-code-387">
-      <description>Generate error XTSE1505</description>
-      <created by="Michael Kay" on="2012-11-07"/>
-      <environment ref="error001"/>
-      <dependencies>
-         <spec value="XSLT20+"/>
-         <feature value="schema_aware"/>
-      </dependencies>
-      <test>
-         <stylesheet file="error-code-387.xsl"/>
-         <initial-template name="main"/>
-      </test>
-      <result>
-         <error code="XTSE1505"/>
-      </result>
-   </test-case>
-
-   <test-case name="error-code-388">
-      <description>Generate error XTTE1510</description>
-      <created by="Michael Kay" on="2012-11-07"/>
-      <environment ref="error001"/>
-      <dependencies>
-         <spec value="XSLT20+"/>
-         <feature value="schema_aware"/>
-      </dependencies>
-      <test>
-         <stylesheet file="error-code-388.xsl"/>
-         <initial-template name="main"/>
-      </test>
-      <result>
-         <error code="XTTE1510"/>
-      </result>
-   </test-case>
-
-   <test-case name="error-code-389">
-      <description>Generate error XTTE1510</description>
-      <created by="Michael Kay" on="2012-11-07"/>
-      <environment ref="error001"/>
-      <dependencies>
-         <spec value="XSLT20+"/>
-         <feature value="schema_aware"/>
-      </dependencies>
-      <test>
-         <stylesheet file="error-code-389.xsl"/>
-         <initial-template name="main"/>
-      </test>
-      <result>
-         <error code="XTTE1510"/>
-      </result>
-   </test-case>
-
-   <test-case name="error-code-390">
-      <description>Generate error XTTE1512</description>
-      <created by="Michael Kay" on="2012-11-07"/>
-      <environment ref="error001"/>
-      <dependencies>
-         <spec value="XSLT20+"/>
-         <feature value="schema_aware"/>
-      </dependencies>
-      <test>
-         <stylesheet file="error-code-390.xsl"/>
-         <initial-template name="main"/>
-      </test>
-      <result>
-         <error code="XTTE1512"/>
-      </result>
-   </test-case>
-
-   <test-case name="error-code-391">
-      <description>Generate error XTTE1512</description>
-      <created by="Michael Kay" on="2012-11-07"/>
-      <environment ref="error001"/>
-      <dependencies>
-         <spec value="XSLT20+"/>
-         <feature value="schema_aware"/>
-      </dependencies>
-      <test>
-         <stylesheet file="error-code-391.xsl"/>
-         <initial-template name="main"/>
-      </test>
-      <result>
-         <error code="XTTE1515"/>
-      </result>
-   </test-case>
-
-   <test-case name="error-code-392">
-      <description>Generate error XTSE1520</description>
-      <created by="Michael Kay" on="2012-11-07"/>
-      <environment ref="error001"/>
-      <dependencies>
-         <spec value="XSLT20+"/>
-         <feature value="schema_aware"/>
-      </dependencies>
-      <test>
-         <stylesheet file="error-code-392.xsl"/>
-         <initial-template name="main"/>
-      </test>
-      <result>
-         <error code="XTSE1520"/>
-      </result>
-   </test-case>
-
-   <test-case name="error-code-393">
-      <description>Generate error XTSE1520</description>
-      <created by="Michael Kay" on="2012-11-07"/>
-      <environment ref="error001"/>
-      <dependencies>
-         <spec value="XSLT20+"/>
-         <feature value="schema_aware"/>
-      </dependencies>
-      <test>
-         <stylesheet file="error-code-393.xsl"/>
-         <initial-template name="main"/>
-      </test>
-      <result>
-         <error code="XTSE1520"/>
-      </result>
-   </test-case>
-
-   <test-case name="error-code-394">
-      <description>Generate error XTSE1520</description>
-      <created by="Michael Kay" on="2012-11-07"/>
-      <environment ref="error001"/>
-      <dependencies>
-         <spec value="XSLT20+"/>
-         <feature value="schema_aware"/>
-      </dependencies>
-      <test>
-         <stylesheet file="error-code-394.xsl"/>
-         <initial-template name="main"/>
-      </test>
-      <result>
-         <error code="XTSE1520"/>
-      </result>
-   </test-case>
-
-   <test-case name="error-code-395">
-      <description>Generate error XTSE1530</description>
-      <created by="Michael Kay" on="2012-11-07"/>
-      <environment ref="error001"/>
-      <dependencies>
-         <spec value="XSLT20+"/>
-         <feature value="schema_aware"/>
-      </dependencies>
-      <test>
-         <stylesheet file="error-code-395.xsl"/>
-         <initial-template name="main"/>
-      </test>
-      <result>
-         <error code="XTSE1530"/>
-      </result>
-   </test-case>
-
-   <test-case name="error-code-396">
-      <description>Generate error XTTE1540</description>
-      <created by="Michael Kay" on="2012-11-07"/>
-      <environment ref="error001"/>
-      <dependencies>
-         <spec value="XSLT20+"/>
-         <feature value="schema_aware"/>
-      </dependencies>
-      <test>
-         <stylesheet file="error-code-396.xsl"/>
-         <initial-template name="main"/>
-      </test>
-      <result>
-         <error code="XTTE1540"/>
-      </result>
-   </test-case>
-
-   <test-case name="error-code-397">
-      <description>Generate error XTTE1545</description>
-      <created by="Michael Kay" on="2012-11-07"/>
-      <environment ref="error001"/>
-      <dependencies>
-         <spec value="XSLT20+"/>
-         <feature value="schema_aware"/>
-      </dependencies>
-      <test>
-         <stylesheet file="error-code-397.xsl"/>
-         <initial-template name="main"/>
-      </test>
-      <result>
-         <error code="XTTE1545"/>
-      </result>
-   </test-case>
-
-   <test-case name="error-code-398">
-      <description>Generate error XTTE1550</description>
-      <created by="Michael Kay" on="2012-11-07"/>
-      <environment ref="error001"/>
-      <dependencies>
-         <spec value="XSLT20+"/>
-         <feature value="schema_aware"/>
-      </dependencies>
-      <test>
-         <stylesheet file="error-code-398.xsl"/>
-         <initial-template name="main"/>
-      </test>
-      <result>
-         <error code="XTTE1550"/>
-      </result>
-   </test-case>
-
-   <test-case name="error-code-399">
-      <description>Generate error XTTE1550</description>
-      <created by="Michael Kay" on="2012-11-07"/>
-      <environment ref="error001"/>
-      <dependencies>
-         <spec value="XSLT20+"/>
-         <feature value="schema_aware"/>
-      </dependencies>
-      <test>
-         <stylesheet file="error-code-399.xsl"/>
-         <initial-template name="main"/>
-      </test>
-      <result>
-         <error code="XTTE1550"/>
-      </result>
-   </test-case>
-
-   <test-case name="error-code-400">
-      <description>Generate error XTTE1555</description>
-      <created by="Michael Kay" on="2012-11-07"/>
-      <environment ref="error001"/>
-      <dependencies>
-         <spec value="XSLT20+"/>
-         <feature value="schema_aware"/>
-      </dependencies>
-      <test>
-         <stylesheet file="error-code-400.xsl"/>
-         <initial-template name="main"/>
-      </test>
-      <result>
-         <error code="XTTE1555"/>
-      </result>
-   </test-case>
-
-   <test-case name="error-code-401">
-      <description>Generate error XTTE1555</description>
-      <created by="Michael Kay" on="2012-11-07"/>
-      <environment ref="error001"/>
-      <dependencies>
-         <spec value="XSLT20+"/>
-         <feature value="schema_aware"/>
-      </dependencies>
-      <test>
-         <stylesheet file="error-code-401.xsl"/>
-         <initial-template name="main"/>
-      </test>
-      <result>
-         <error code="XTTE1555"/>
-      </result>
-   </test-case>
-
-   <test-case name="error-code-402">
-      <description>Generate error XTTE1555</description>
-      <created by="Michael Kay" on="2012-11-07"/>
-      <environment ref="error001"/>
-      <dependencies>
-         <spec value="XSLT20+"/>
-         <feature value="schema_aware"/>
-      </dependencies>
-      <test>
-         <stylesheet file="error-code-402.xsl"/>
-         <initial-template name="main"/>
-      </test>
-      <result>
-         <error code="XTTE1555"/>
-      </result>
-   </test-case>
-
-   <test-case name="error-code-403">
-      <description>Generate error XTSE1560</description>
-      <created by="Michael Kay" on="2012-11-07"/>
-      <environment ref="error001"/>
-      <dependencies>
-         <spec value="XSLT20+"/>
-      </dependencies>
-      <test>
-         <stylesheet file="error-code-403.xsl"/>
-         <initial-template name="main"/>
-      </test>
-      <result>
-         <error code="XTSE1560"/>
-      </result>
-   </test-case>
-
-   <test-case name="error-code-404">
-      <description>Generate error XTSE1560</description>
-      <created by="Michael Kay" on="2012-11-07"/>
-      <environment ref="error001"/>
-      <dependencies>
-         <spec value="XSLT20+"/>
-      </dependencies>
-      <test>
-         <stylesheet file="error-code-404.xsl"/>
-         <initial-template name="main"/>
-      </test>
-      <result>
-         <error code="XTSE1560"/>
-      </result>
-   </test-case>
-
-   <test-case name="error-code-405">
-      <description>Generate error XTSE1570</description>
-      <created by="Michael Kay" on="2012-11-07"/>
-      <environment ref="error001"/>
-      <dependencies>
-         <spec value="XSLT20+"/>
-      </dependencies>
-      <test>
-         <stylesheet file="error-code-405.xsl"/>
-         <initial-template name="main"/>
-      </test>
-      <result>
-         <error code="XTSE1570"/>
-      </result>
-   </test-case>
-
-   <test-case name="error-code-406">
-      <description>Generate error XTSE1580</description>
-      <created by="Michael Kay" on="2012-11-07"/>
-      <environment ref="error001"/>
-      <dependencies>
-         <spec value="XSLT20+"/>
-      </dependencies>
-      <test>
-         <stylesheet file="error-code-406.xsl"/>
-         <initial-template name="main"/>
-      </test>
-      <result>
-         <error code="XTSE1580"/>
-      </result>
-   </test-case>
-
-   <test-case name="error-code-407">
-      <description>Generate error XTSE1590</description>
-      <created by="Michael Kay" on="2012-11-07"/>
-      <environment ref="error001"/>
-      <dependencies>
-         <spec value="XSLT20+"/>
-      </dependencies>
-      <test>
-         <stylesheet file="error-code-407.xsl"/>
-         <initial-template name="main"/>
-      </test>
-      <result>
-         <error code="XTSE1590"/>
-      </result>
-   </test-case>
-
-   <test-case name="error-code-408">
-      <description>Generate error XTSE1600</description>
-      <created by="Michael Kay" on="2012-11-07"/>
-      <environment ref="error001"/>
-      <dependencies>
-         <spec value="XSLT20+"/>
-      </dependencies>
-      <test>
-         <stylesheet file="error-code-408.xsl"/>
-         <initial-template name="main"/>
-      </test>
-      <result>
-         <error code="XTSE1600"/>
-      </result>
-   </test-case>
-
-   <test-case name="error-code-409">
-      <description>Generate error XTDE0040</description>
-      <created by="Michael Kay" on="2012-11-07"/>
-      <dependencies>
-         <spec value="XSLT20+"/>
-      </dependencies>
-      <test>
-         <stylesheet file="error-code-409.xsl"/>
-         <initial-template name="main"/>
-      </test>
-      <result>
-         <error code="XTDE0040"/>
-      </result>
-   </test-case>
-
-   <test-case name="error-code-410">
-      <description>Generate error XTDE0610 for a global parameter</description>
-      <created by="Colin Adams" on="2012-11-07"/>
-      <dependencies>
-         <spec value="XSLT20+"/>
-      </dependencies>
-      <test>
-         <stylesheet file="error-code-410.xsl"/>
-         <initial-template name="initial"/>
-      </test>
-      <result>
-         <error code="XTDE0610"/>
-      </result>
-   </test-case>
-
-   <test-case name="error-code-411">
-      <description>Attempt to write twice to implicit final result tree</description>
-      <created by="Colin Adams" on="2012-11-07"/>
-      <dependencies>
-         <spec value="XSLT20+"/>
-      </dependencies>
-      <test>
-         <stylesheet file="error-code-411.xsl"/>
-         <initial-template name="initial"/>
-      </test>
-      <result>
-         <error code="XTDE1490"/>
-      </result>
-   </test-case>
-</test-set>
--- a/tests/misc/error-code/convert-tests.xsl	Mon Mar 30 18:49:39 2015 +0200
+++ /dev/null	Thu Jan 01 00:00:00 1970 +0000
@@ -1,158 +0,0 @@
-<?xml version="1.0" encoding="UTF-8"?>
-<xsl:stylesheet xmlns:xsl="http://www.w3.org/1999/XSL/Transform"
-    xmlns:xs="http://www.w3.org/2001/XMLSchema"
-    xmlns:t="http://www.w3.org/1999/XSL/TransformAlias"
-    xmlns:c="http://www.w3.org/2012/10/xslt-test-catalog"
-    exclude-result-prefixes="c xs"
-    expand-text="yes"
-    version="3.0">
-    
-    <xsl:param name="spec-uri" as="xs:string" required="yes"/>
-    <xsl:variable name="spec" select="doc($spec-uri)"/>
-    
-    <xsl:variable name="test-set" as="document-node()" select="/"/>
-    
-    <xsl:mode on-no-match="shallow-copy"/>
-    <xsl:mode name="copy-tests" on-no-match="shallow-copy"/>
-    <xsl:mode name="error-desc" />
-    
-    <xsl:variable name="tested-codes" select="distinct-values(//error/@code)"/>
-    
-    <xsl:variable name="all-errors" select="$spec//error"/>
-    
-    <xsl:namespace-alias stylesheet-prefix="t" result-prefix="xsl"/>
-    
-    <xsl:output method="xml" indent="yes" saxon:double-space="c:test-case" cdata-section-elements="c:content" xmlns:saxon="http://saxon.sf.net/"/>
-    
-    <xsl:template match="/">
-        <xsl:message>Bad error codes: {$tested-codes[not(. = $all-errors/@code)]}</xsl:message>
-        <test-set xmlns:xs="http://www.w3.org/2001/XMLSchema"
-            xmlns="http://www.w3.org/2012/10/xslt-test-catalog"
-            name="error-code">
-            
-            <description>
-                Tests error conditions. 
-                This test set should include a test for every error code (however, coverage of new XSLT 3.0 errors is incomplete).
-            </description>
-            
-            <environment name="error001">
-                <source role=".">
-                    <content><![CDATA[<doc>
-  <element attribute="3"/>
-</doc>]]></content>
-                </source>
-            </environment>
-            
-            <environment name="error152">
-                <source role=".">
-                    <content><![CDATA[ 
-                        
-<doc>
-    <item val="1"/>
-    <item val="2"/>
-    <item val="3"/>
-    <item val="4"/>
-    <item val="5"/>                
-</doc>]]></content>
-                </source>
-            </environment>
-            
-            <environment name="error214">
-                <source role=".">
-                    <content><![CDATA[<t04>
-  <a id="a" code="1" value="10"/>
-  <a id="b" code="2" value="20"/>
-  <a id="c" code="2" value="30"/>
-  <a id="d" code="1" value="40"/>
-</t04>]]></content>
-                </source>
-            </environment>
-            
-            
-        <xsl:for-each-group select="$all-errors" group-by="@code">
-            <xsl:sort select="@code"/>
-            <xsl:variable name="full-code" select="concat(@spec, @class, @code)"/>
-            <xsl:variable name="short-code" select="@code"/>
-            <xsl:variable name="existing" select="$test-set//c:test-case[.//c:error/@code = $full-code]"/>
-            <xsl:variable name="desc">
-                <!--<xsl:value-of select="."/>-->
-                <xsl:apply-templates select="." mode="error-desc"/>
-            </xsl:variable>
-            <xsl:choose>
-                <xsl:when test="exists($existing)">
-                    <xsl:apply-templates select="$existing" mode="copy-tests">
-                        <xsl:with-param name="full-code" select="$full-code" tunnel="yes"/>
-                        <xsl:with-param name="error-desc" select="$desc" tunnel="yes"/>
-                    </xsl:apply-templates>
-                </xsl:when>
-                <xsl:otherwise>
-                    <test-case name="error-{$short-code}a">
-                        <description>Error: {$desc}</description>
-                        <created by="Michael Kay" on="2014-08-25"/>
-                        <dependencies>
-                            <spec value="XSLT30+"/>
-                        </dependencies>
-                        <test>
-                            <stylesheet file="error-{$short-code}a.xsl"/>
-                            <initial-template name="main"/>
-                        </test>
-                        <result>
-                            <error code="{$full-code}"/>
-                        </result>
-                    </test-case>
-                    <xsl:result-document href="error-{$short-code}a.xsl" method="xml" indent="yes">
-                        <t:stylesheet version="3.0">
-                            <xsl:comment>
-                                <xsl:copy-of select="$desc"/>
-                            </xsl:comment>
-                            <t:template name="main">
-                                <out xmlns="">
-                                    <x/>
-                                </out>
-                            </t:template>
-                        </t:stylesheet>
-                    </xsl:result-document>   
-                </xsl:otherwise>
-            </xsl:choose>
-        </xsl:for-each-group>
-        </test-set>
-    </xsl:template>
-    
-    <xsl:template match="termref[not(node())]" mode="error-desc">
-        <xsl:value-of select="$spec//termdef[@id = current()/@def]/@term"/>
-    </xsl:template> 
-    
-    <xsl:template match="c:test-case" mode="copy-tests">
-        <xsl:next-match>
-            <xsl:with-param name="position" tunnel="yes">
-                <xsl:number value="position()" format="a"/>
-            </xsl:with-param>
-        </xsl:next-match>
-    </xsl:template>
-    
-    <xsl:template match="c:test-case/@name" mode="copy-tests">
-        <xsl:param name="full-code" tunnel="yes"/>
-        <xsl:param name="position" tunnel="yes"/>
-        <xsl:attribute name="name">error-{substring($full-code, 5)}{$position}</xsl:attribute>
-    </xsl:template>
-    
-    <xsl:template match="c:description" mode="copy-tests">
-        <xsl:param name="error-desc" tunnel="yes"/>
-        <description><xsl:value-of select="."/>.&#xa;Was <xsl:value-of select="../@name"/>.&#xa;<xsl:value-of select="$error-desc"/></description>
-    </xsl:template>
-    
-    <xsl:template match="c:stylesheet[not(@role='secondary')]/@file" mode="copy-tests">
-        <xsl:param name="full-code" tunnel="yes"/>
-        <xsl:param name="position" tunnel="yes"/>
-        <xsl:attribute name="file">error-{substring($full-code, 5)}{$position}.xsl</xsl:attribute>
-        <xsl:result-document href="error-{substring($full-code, 5)}{$position}.xsl">
-            <xsl:apply-templates select="document(.)" mode="#current"/>
-        </xsl:result-document>
-    </xsl:template>
-    
-    <xsl:template match="/" mode="copy-tests">
-        <xsl:param name="error-desc" tunnel="yes"/>
-        <xsl:comment><xsl:copy-of select="$error-desc"/></xsl:comment>
-        <xsl:copy-of select="."/>
-    </xsl:template>
-</xsl:stylesheet>
\ No newline at end of file
--- a/tests/misc/error-code/error-code-001.xsl	Mon Mar 30 18:49:39 2015 +0200
+++ /dev/null	Thu Jan 01 00:00:00 1970 +0000
@@ -1,15 +0,0 @@
-<?xml version="1.0"?> 
-
-<xsl:stylesheet xmlns:xsl="http://www.w3.org/1999/XSL/Transform" version="2.0">
-
-<!-- Error: XPath syntax -->
-<?spec xpath#errors?><?error XPST0003?>
-
-  <xsl:template match="doc">
-    <out>
-      <xsl:value-of select="//"/>
-      <xsl:message>Error not detected!</xsl:message>
-    </out>
-  </xsl:template>
-
-</xsl:stylesheet>
\ No newline at end of file
--- a/tests/misc/error-code/error-code-002.xsl	Mon Mar 30 18:49:39 2015 +0200
+++ /dev/null	Thu Jan 01 00:00:00 1970 +0000
@@ -1,15 +0,0 @@
-<?xml version="1.0"?> 
-
-<xsl:stylesheet xmlns:xsl="http://www.w3.org/1999/XSL/Transform" version="2.0">
-
-<!-- Error: XPath syntax -->
-<?spec xpath#errors?><?error XPST0003?>
-
-  <xsl:template match="doc">
-    <out>
-      <xsl:value-of select="./item/"/>
-      <xsl:message>Error not detected!</xsl:message>
-    </out>
-  </xsl:template>
-
-</xsl:stylesheet>
\ No newline at end of file
--- a/tests/misc/error-code/error-code-003.xsl	Mon Mar 30 18:49:39 2015 +0200
+++ /dev/null	Thu Jan 01 00:00:00 1970 +0000
@@ -1,15 +0,0 @@
-<?xml version="1.0"?> 
-
-<xsl:stylesheet xmlns:xsl="http://www.w3.org/1999/XSL/Transform" version="2.0">
-
-<!-- Error: XPath syntax -->
-<?spec xpath#errors?><?error XPST0003?>
-
-  <xsl:template match="doc">
-    <out>
-      <xsl:value-of select="item 17"/>
-      <xsl:message>Error not detected!</xsl:message>
-    </out>
-  </xsl:template>
-
-</xsl:stylesheet>
\ No newline at end of file
--- a/tests/misc/error-code/error-code-004.xsl	Mon Mar 30 18:49:39 2015 +0200
+++ /dev/null	Thu Jan 01 00:00:00 1970 +0000
@@ -1,16 +0,0 @@
-<?xml version="1.0"?> 
-
-<xsl:stylesheet xmlns:xsl="http://www.w3.org/1999/XSL/Transform" version="2.0">
-
-<!-- Error: XPath syntax -->
-<?spec xpath#errors?><?error XPST0003?>
-<!-- unmatched square brackets -->
-
-  <xsl:template match="doc">
-    <out>
-      <xsl:value-of select="item [17"/>
-      <xsl:message>Error not detected!</xsl:message>
-    </out>
-  </xsl:template>
-
-</xsl:stylesheet>
\ No newline at end of file
--- a/tests/misc/error-code/error-code-005.xsl	Mon Mar 30 18:49:39 2015 +0200
+++ /dev/null	Thu Jan 01 00:00:00 1970 +0000
@@ -1,16 +0,0 @@
-<?xml version="1.0"?> 
-
-<xsl:stylesheet xmlns:xsl="http://www.w3.org/1999/XSL/Transform" version="2.0">
-
-<!-- Error: XPath syntax -->
-<?spec xpath#errors?><?error XPST0003?>
-<!-- unclosed string -->
-
-  <xsl:template match="doc">
-    <out>
-      <xsl:value-of select="'unterminated"/>
-      <xsl:message>Error not detected!</xsl:message>
-    </out>
-  </xsl:template>
-
-</xsl:stylesheet>
\ No newline at end of file
--- a/tests/misc/error-code/error-code-006.xsl	Mon Mar 30 18:49:39 2015 +0200
+++ /dev/null	Thu Jan 01 00:00:00 1970 +0000
@@ -1,15 +0,0 @@
-<?xml version="1.0"?> 
-
-<xsl:stylesheet xmlns:xsl="http://www.w3.org/1999/XSL/Transform" version="2.0">
-
-<!-- Error: XPath syntax -->
-<?spec xpath#errors?><?error XPST0003?>
-
-  <xsl:template match="doc">
-    <out>
-      <xsl:value-of select="item * * @value"/>
-      <xsl:message>Error not detected!</xsl:message>
-    </out>
-  </xsl:template>
-
-</xsl:stylesheet>
\ No newline at end of file
--- a/tests/misc/error-code/error-code-007.xsl	Mon Mar 30 18:49:39 2015 +0200
+++ /dev/null	Thu Jan 01 00:00:00 1970 +0000
@@ -1,21 +0,0 @@
-<?xml version="1.0"?> 
-
-<xsl:stylesheet xmlns:xsl="http://www.w3.org/1999/XSL/Transform" version="2.0"
-xmlns:xs="http://www.w3.org/2001/XMLSchema">
-
-  <!-- PURPOSE: Test declaring a variable with incorrect type "element/attribute of type X". -->
-  <?spec xslt#errors?><?error XPTE0570?>
-
-<xsl:variable name="tree" >
-  <e1><xsl:attribute name="id" type="xs:ID">A001</xsl:attribute></e1>
-  <e2 xsl:type="xs:NMTOKEN">A002</e2>
-</xsl:variable>
-
-<xsl:variable name="v1" select="$tree/e1/@id" as="attribute(*,xs:ID)"/>
-<xsl:variable name="v2" select="$tree/e2" as="element(*, xs:NMTOKEN)"/>            
-<xsl:variable name="v3" select="$tree/e2" as="attribute(*, xs:NMTOKEN)"/>    
-  <xsl:template match="/">
-    <out val="{($v1, $v2, $v3)}"/>
-  </xsl:template>
-
-</xsl:stylesheet>
\ No newline at end of file
--- a/tests/misc/error-code/error-code-008.xsl	Mon Mar 30 18:49:39 2015 +0200
+++ /dev/null	Thu Jan 01 00:00:00 1970 +0000
@@ -1,16 +0,0 @@
-<?xml version="1.0"?> 
-
-<xsl:stylesheet xmlns:xsl="http://www.w3.org/1999/XSL/Transform" version="2.0">
-
-<!-- Error: XPath syntax -->
-<?spec xpath#errors?><?error XPST0003?>
-<!-- processing instruction must be a QName -->
-
-  <xsl:template match="doc">
-    <out>
-      <xsl:value-of select="processing-instruction(3)"/>
-      <xsl:message>Error not detected!</xsl:message>
-    </out>
-  </xsl:template>
-
-</xsl:stylesheet>
\ No newline at end of file
--- a/tests/misc/error-code/error-code-009.xsl	Mon Mar 30 18:49:39 2015 +0200
+++ /dev/null	Thu Jan 01 00:00:00 1970 +0000
@@ -1,16 +0,0 @@
-<?xml version="1.0"?> 
-
-<xsl:stylesheet xmlns:xsl="http://www.w3.org/1999/XSL/Transform" version="2.0">
-
-<!-- Error: XPath syntax -->
-<?spec xpath#errors?><?error XPST0003?>
-<!-- unknown axis -->
-
-  <xsl:template match="doc">
-    <out>
-      <xsl:value-of select="nephew::*"/>
-      <xsl:message>Error not detected!</xsl:message>
-    </out>
-  </xsl:template>
-
-</xsl:stylesheet>
\ No newline at end of file
--- a/tests/misc/error-code/error-code-010.xsl	Mon Mar 30 18:49:39 2015 +0200
+++ /dev/null	Thu Jan 01 00:00:00 1970 +0000
@@ -1,15 +0,0 @@
-<?xml version="1.0"?> 
-
-<xsl:stylesheet xmlns:xsl="http://www.w3.org/1999/XSL/Transform" version="2.0">
-
-<!-- Error: XPath syntax -->
-<?spec xpath#errors?><?error XPST0017?>
-
-  <xsl:template match="doc">
-    <out>
-      <xsl:value-of select="unknown-function()"/>
-      <xsl:message>Error not detected!</xsl:message>
-    </out>
-  </xsl:template>
-
-</xsl:stylesheet>
\ No newline at end of file
--- a/tests/misc/error-code/error-code-011.xsl	Mon Mar 30 18:49:39 2015 +0200
+++ /dev/null	Thu Jan 01 00:00:00 1970 +0000
@@ -1,21 +0,0 @@
-<?xml version="1.0"?> 
-
-<xsl:stylesheet xmlns:xsl="http://www.w3.org/1999/XSL/Transform" version="2.0"
-xmlns:xs="http://www.w3.org/2001/XMLSchema">
-
-  <!-- PURPOSE: Test declaring a variable with incorrect type "element/attribute of type X". -->
-<?spec xslt#errors?><?error XTSE0010?>
-
-<xsl:variable name="tree">
-  <e1><xsl:attribute name="id" type="xs:ID">A001</xsl:attribute></e1>
-  <e2 xsl:type="xs:NMTOKEN">A002</e2>
-</xsl:variable>
-
-<xsl:variable name="v1" select="$tree/e1/@id" as="attribute(*, xs:ID)"/>
-<xsl:variable name="v2" select="$tree/e2" as="element(*, xs:NMTOKEN)"/>            
-<xsl:variable name="v3" select="$tree/e2" as="element(*, xs:integer)"/>    
-  <xsl:template match="/">
-    <out val="{($v1, $v2, $v3)}"/>
-  </xsl:template>
-
-</xsl:stylesheet>
\ No newline at end of file
--- a/tests/misc/error-code/error-code-012.xsl	Mon Mar 30 18:49:39 2015 +0200
+++ /dev/null	Thu Jan 01 00:00:00 1970 +0000
@@ -1,15 +0,0 @@
-<?xml version="1.0"?> 
-
-<xsl:stylesheet xmlns:xsl="http://www.w3.org/1999/XSL/Transform" version="2.0">
-
-<!-- Error: XPath syntax -->
-<?spec xpath#errors?><?error XPST0003?>
-
-  <xsl:template match="doc">
-    <out>
-      <xsl:value-of select="undeclared:function()"/> 
-      <xsl:message>Error not detected!</xsl:message>
-    </out>
-  </xsl:template>
-
-</xsl:stylesheet>
\ No newline at end of file
--- a/tests/misc/error-code/error-code-013.xsl	Mon Mar 30 18:49:39 2015 +0200
+++ /dev/null	Thu Jan 01 00:00:00 1970 +0000
@@ -1,15 +0,0 @@
-<?xml version="1.0"?> 
-
-<xsl:stylesheet xmlns:xsl="http://www.w3.org/1999/XSL/Transform" version="2.0">
-
-<!-- Error: XPath syntax -->
-<?spec xpath#errors?><?error XPST0003?>
-
-  <xsl:template match="doc">
-    <out>
-      <xsl:value-of select="$undeclared"/> 
-      <xsl:message>Error not detected!</xsl:message>
-    </out>
-  </xsl:template>
-
-</xsl:stylesheet>
\ No newline at end of file
--- a/tests/misc/error-code/error-code-014.xsl	Mon Mar 30 18:49:39 2015 +0200
+++ /dev/null	Thu Jan 01 00:00:00 1970 +0000
@@ -1,15 +0,0 @@
-<?xml version="1.0"?> 
-
-<xsl:stylesheet xmlns:xsl="http://www.w3.org/1999/XSL/Transform" version="2.0">
-
-<!-- Error: XPath syntax -->
-<?spec xpath#errors?><?error XPST0003?>
-
-  <xsl:template match="doc">
-    <out>
-      <xsl:value-of select="@price-@tax"/> <!-- needs a space --> 
-      <xsl:message>Error not detected!</xsl:message>
-    </out>
-  </xsl:template>
-
-</xsl:stylesheet>
\ No newline at end of file
--- a/tests/misc/error-code/error-code-015.xsl	Mon Mar 30 18:49:39 2015 +0200
+++ /dev/null	Thu Jan 01 00:00:00 1970 +0000
@@ -1,15 +0,0 @@
-<?xml version="1.0"?> 
-
-<xsl:stylesheet xmlns:xsl="http://www.w3.org/1999/XSL/Transform" version="2.0">
-
-<!-- Error: XPath syntax -->
-<?spec xpath#errors?><?error XPST0003?>
-
-  <xsl:template match="doc">
-    <out>
-      <xsl:value-of select="div div div 0"/> 
-      <xsl:message>Error not detected!</xsl:message>
-    </out>
-  </xsl:template>
-
-</xsl:stylesheet>
\ No newline at end of file
--- a/tests/misc/error-code/error-code-016.xsl	Mon Mar 30 18:49:39 2015 +0200
+++ /dev/null	Thu Jan 01 00:00:00 1970 +0000
@@ -1,15 +0,0 @@
-<?xml version="1.0"?> 
-
-<xsl:stylesheet xmlns:xsl="http://www.w3.org/1999/XSL/Transform" version="2.0">
-
-<!-- Error: XPath syntax -->
-<?spec xpath#errors?><?error XPST0003?>
-
-  <xsl:template match="doc">
-    <out>
-      <xsl:value-of select="true :()"/> 
-      <xsl:message>Error not detected!</xsl:message>
-    </out>
-  </xsl:template>
-
-</xsl:stylesheet>
\ No newline at end of file
--- a/tests/misc/error-code/error-code-017.xsl	Mon Mar 30 18:49:39 2015 +0200
+++ /dev/null	Thu Jan 01 00:00:00 1970 +0000
@@ -1,15 +0,0 @@
-<?xml version="1.0"?> 
-
-<xsl:stylesheet xmlns:xsl="http://www.w3.org/1999/XSL/Transform" version="2.0">
-
-<!-- Error: XPath syntax -->
-<?spec xpath#errors?><?error XPST0017?>
-
-  <xsl:template match="doc">
-    <out>
-      <xsl:value-of select="true(false())"/> 
-      <xsl:message>Error not detected!</xsl:message>
-    </out>
-  </xsl:template>
-
-</xsl:stylesheet>
\ No newline at end of file
--- a/tests/misc/error-code/error-code-018.xsl	Mon Mar 30 18:49:39 2015 +0200
+++ /dev/null	Thu Jan 01 00:00:00 1970 +0000
@@ -1,16 +0,0 @@
-<?xml version="1.0"?> 
-
-<xsl:stylesheet xmlns:xsl="http://www.w3.org/1999/XSL/Transform" version="2.0">
-
-<!-- Error: <xsl:param> must come first -->
-<?spec xslt#errors?><?error XTSE0010?>
-
-  <xsl:template match="doc">
-    <out/>
-    <xsl:param name="p"/>
-    <out>
-      <xsl:message>Error not detected!</xsl:message>
-    </out>
-  </xsl:template>
-
-</xsl:stylesheet>
\ No newline at end of file
--- a/tests/misc/error-code/error-code-019.xsl	Mon Mar 30 18:49:39 2015 +0200
+++ /dev/null	Thu Jan 01 00:00:00 1970 +0000
@@ -1,18 +0,0 @@
-<xsl:stylesheet version="2.0" 
-	xmlns:xsl="http://www.w3.org/1999/XSL/Transform" 	
->
-	
-	<!-- TEST xsl:namespace declaring the default namespace (XSLT 2.0) -->
-	<!-- this is an error if the element is in no namespace -->
-	<?spec xslt#errors?><?error XTDE0440?>
-	
-	<xsl:param name="param" select="'http://a-namespace-uri/'"/>
-
-	<xsl:template match="/">
-		<out xmlns:x="http://some.uri/">
-		  <xsl:namespace name=""><xsl:value-of select="$param"/></xsl:namespace>
-		  <xsl:attribute name="new">at XSLT 2.0</xsl:attribute>
-		</out>
-	</xsl:template>
-
-</xsl:stylesheet>
--- a/tests/misc/error-code/error-code-020.xsl	Mon Mar 30 18:49:39 2015 +0200
+++ /dev/null	Thu Jan 01 00:00:00 1970 +0000
@@ -1,15 +0,0 @@
-<?xml version="1.0"?> 
-
-<xsl:stylesheet xmlns:xsl="http://www.w3.org/1999/XSL/Transform" version="2.0">
-
-<!-- Error: XPath syntax -->
-<?spec xpath#errors?><?error XPTY0004?>
-
-  <xsl:template match="doc">
-    <out>
-      <xsl:value-of select="3 | 'bread'"/> 
-      <xsl:message>Error not detected!</xsl:message>
-    </out>
-  </xsl:template>
-
-</xsl:stylesheet>
\ No newline at end of file
--- a/tests/misc/error-code/error-code-021.xsl	Mon Mar 30 18:49:39 2015 +0200
+++ /dev/null	Thu Jan 01 00:00:00 1970 +0000
@@ -1,15 +0,0 @@
-<?xml version="1.0"?> 
-
-<xsl:stylesheet xmlns:xsl="http://www.w3.org/1999/XSL/Transform" version="2.0">
-
-<!-- Error: XPath syntax -->
-<?spec xpath#errors?><?error XPST0003?>
-
-  <xsl:template match="doc">
-    <out>
-      <xsl:value-of select="child: :node()"/> 
-      <xsl:message>Error not detected!</xsl:message>
-    </out>
-  </xsl:template>
-
-</xsl:stylesheet>
\ No newline at end of file
--- a/tests/misc/error-code/error-code-022.xsl	Mon Mar 30 18:49:39 2015 +0200
+++ /dev/null	Thu Jan 01 00:00:00 1970 +0000
@@ -1,15 +0,0 @@
-<?xml version="1.0"?> 
-
-<xsl:stylesheet xmlns:xsl="http://www.w3.org/1999/XSL/Transform" version="2.0">
-
-<!-- Error: XPath syntax -->
-<?spec xpath#errors?><?error XPST0003?>
-
-  <xsl:template match="doc">
-    <out>
-      <xsl:value-of select="undeclared:element"/> 
-      <xsl:message>Error not detected!</xsl:message>
-    </out>
-  </xsl:template>
-
-</xsl:stylesheet>
\ No newline at end of file
--- a/tests/misc/error-code/error-code-023.xsl	Mon Mar 30 18:49:39 2015 +0200
+++ /dev/null	Thu Jan 01 00:00:00 1970 +0000
@@ -1,15 +0,0 @@
-<?xml version="1.0"?> 
-
-<xsl:stylesheet xmlns:xsl="http://www.w3.org/1999/XSL/Transform" version="2.0">
-
-<!-- Error: XPath syntax -->
-<?spec xpath#errors?><?error XPST0003?>
-
-  <xsl:template match="doc">
-    <out>
-      <xsl:value-of select="@undeclared:attribute"/> 
-      <xsl:message>Error not detected!</xsl:message>
-    </out>
-  </xsl:template>
-
-</xsl:stylesheet>
\ No newline at end of file
--- a/tests/misc/error-code/error-code-024.xsl	Mon Mar 30 18:49:39 2015 +0200
+++ /dev/null	Thu Jan 01 00:00:00 1970 +0000
@@ -1,15 +0,0 @@
-<?xml version="1.0"?>